program: Orca
programVersion: 5.0.2
elementType: O O O O N C C C C C C C C C C C C C C C C C C C H H H H H H H H H H H H H H H H H H H H H H H H H
charge: 0
multiplicity: 1
keywords: wb97x-d3
keywords: def2-TZVPP
keywords: def2/J RIJCOSX
keywords: DEFGRID2
keywords: scfconv7
keywords: smallprint printgap noloewdin
keywords: NOSOSCF
formula: C19H25NO4
InChI: InChI=1/C19H25NO4/c1-11(2)9-14-15(19(14,3)4)18(23)24-10-20-16(21)12-7-5-6-8-13(12)17(20)22/h9,14-15H,5-8,10H2,1-4H3
49 atoms
O  -0.25293 1.127654 0.683457
O  -1.447488 2.03926 -0.98092
O  1.732853 0.144825 -1.656986
O  2.934999 1.61355 2.470275
N  2.045807 1.144261 0.392216
C  -3.796757 0.582133 0.545997
C  -3.430118 -0.167462 -0.69484
C  -2.341849 0.211757 0.280701
C  -4.274382 2.006558 0.419371
C  -4.459463 -0.168443 1.673902
C  -3.771568 -1.600314 -0.886385
C  -1.339244 1.219895 -0.098816
C  -4.882458 -2.03406 -1.48767
C  0.873164 1.952667 0.406708
C  -5.154812 -3.495987 -1.66712
C  -5.937618 -1.117548 -2.026331
C  3.638363 -0.388367 -0.256618
C  3.999068 0.059951 0.946741
C  4.385605 -1.387598 -1.057217
C  5.232037 -0.336231 1.669071
C  5.448077 -2.054735 -0.18127
C  6.180762 -1.044441 0.700209
C  2.377317 0.284662 -0.647242
C  2.975914 1.026541 1.418088
H  -3.450843 0.438637 -1.596452
H  -1.959365 -0.585181 0.90917
H  -3.862624 2.523591 -0.444136
H  -5.360887 2.014516 0.313054
H  -4.029712 2.58617 1.31138
H  -4.067982 -1.178054 1.793145
H  -4.319729 0.357333 2.619983
H  -5.533731 -0.249007 1.495105
H  -3.063404 -2.333101 -0.510562
H  0.965961 2.698599 1.193462
H  0.766781 2.461989 -0.548408
H  -6.088861 -3.782426 -1.177229
H  -5.273024 -3.745843 -2.724663
H  -4.356143 -4.11677 -1.261618
H  -6.911868 -1.361185 -1.595446
H  -5.739489 -0.065933 -1.825401
H  -6.042058 -1.239231 -3.107688
H  3.69981 -2.129862 -1.472228
H  4.845924 -0.88983 -1.916351
H  5.710208 0.541475 2.109787
H  4.970202 -0.990811 2.506116
H  4.970919 -2.807213 0.452302
H  6.160732 -2.584414 -0.814219
H  6.66852 -0.298575 0.066496
H  6.970766 -1.542594 1.263056
elementType: O N C H
totalener: -1094.86865308 hartree
nucrepener: 2043.69872087 hartree
electener: -3138.56737395 hartree
oneelecener: -5549.73187277 hartree
twoeener: 2411.16449882 hartree
cpcmener: -0.03772937 hartree
kineticenergy: 1090.03849288 hartree
xcener: -105.972991796657 hartree
chargesum: -0.0000000
charge: -0.286080 -0.487174 -0.438139 -0.435195 -0.095133 0.126098 -0.011431 -0.132106 -0.294852 -0.271386 -0.252540 0.442130 -0.043399 0.077193 -0.229598 -0.248766 -0.060898 -0.079919 -0.068893 -0.074137 -0.136044 -0.134869 0.336999 0.344065 0.099146 0.097732 0.094405 0.097275 0.102677 0.093532 0.101185 0.097649 0.123833 0.128105 0.140897 0.094868 0.095111 0.090534 0.096598 0.086780 0.102725 0.094534 0.101433 0.093164 0.102459 0.079056 0.081034 0.078619 0.080719
qa: -0.2861 -0.4872 -0.4381 -0.4352 -0.0951 0.1261 -0.0114 -0.1321 -0.2949 -0.2714 -0.2525 0.4421 -0.0434 0.0772 -0.2296 -0.2488 -0.0609 -0.0799 -0.0689 -0.0741 -0.1360 -0.1349 0.3370 0.3441 0.0991 0.0977 0.0944 0.0973 0.1027 0.0935 0.1012 0.0976 0.1238 0.1281 0.1409 0.0949 0.0951 0.0905 0.0966 0.0868 0.1027 0.0945 0.1014 0.0932 0.1025 0.0791 0.0810 0.0786 0.0807
va: 2.1068 2.0197 2.0726 2.0762 3.1086 3.6809 3.7962 3.8612 3.8999 3.9070 3.8563 4.1482 3.7077 3.8501 3.9274 3.9373 3.6859 3.7120 3.9210 3.9197 3.9176 3.9151 4.1924 4.1967 1.0254 1.0352 1.0172 1.0003 1.0001 1.0021 1.0032 1.0007 1.0062 1.0120 1.0169 0.9963 0.9952 1.0071 0.9978 1.0080 0.9986 1.0147 1.0049 1.0155 1.0050 1.0063 1.0094 1.0069 1.0094
dispcorr: -0.022489652 hartree
energy: -1094.891142733925
dipole: -22.78651 23.73787 0.95135 -15.25867 13.69593 -1.56274 -2.72862 3.32445 0.59583
magnitude: 1.92412 au
magnitude: 4.89073 debye
