program: Orca
programVersion: 5.0.2
elementType: O O O O N C C C C C C C C C C C C C C C C C C C H H H H H H H H H H H H H H H H H H H H H H H H H
charge: 0
multiplicity: 1
keywords: wb97x-d3
keywords: def2-TZVPP
keywords: def2/J RIJCOSX
keywords: DEFGRID2
keywords: scfconv7
keywords: smallprint printgap noloewdin
keywords: NOSOSCF
formula: C19H25NO4
InChI: InChI=1/C19H25NO4/c1-11(2)9-14-15(19(14,3)4)18(23)24-10-20-16(21)12-7-5-6-8-13(12)17(20)22/h9,14-15H,5-8,10H2,1-4H3
49 atoms
O  -0.267594 1.26579 0.7911
O  -1.371863 2.056697 -0.995405
O  1.581095 0.204351 -1.574808
O  3.037689 1.672365 2.471051
N  2.026992 1.20946 0.447361
C  -3.791588 0.651569 0.451491
C  -3.32546 -0.175025 -0.703651
C  -2.315667 0.293347 0.31737
C  -4.277402 2.055158 0.192882
C  -4.522557 -0.03135 1.580751
C  -3.627588 -1.624781 -0.81778
C  -1.30557 1.293306 -0.061257
C  -4.678424 -2.122372 -1.474978
C  0.881474 2.056853 0.514285
C  -4.911376 -3.598483 -1.576865
C  -5.700811 -1.266155 -2.156845
C  3.514696 -0.406863 -0.246668
C  3.954189 0.046187 0.928498
C  4.165168 -1.470009 -1.049957
C  5.194878 -0.401728 1.605378
C  5.211243 -2.185249 -0.192982
C  6.04967 -1.201242 0.620838
C  2.27243 0.323291 -0.59343
C  2.999715 1.066235 1.429544
H  -3.289983 0.365439 -1.645576
H  -1.96723 -0.451113 1.024805
H  -3.836242 2.508596 -0.691793
H  -5.35869 2.03998 0.043253
H  -4.075588 2.706258 1.045611
H  -4.469753 0.568517 2.490898
H  -5.577322 -0.157428 1.327867
H  -4.11667 -1.01668 1.806362
H  -2.940094 -2.313998 -0.336028
H  1.016543 2.767448 1.326514
H  0.770694 2.606438 -0.417565
H  -5.878188 -3.87234 -1.147179
H  -4.93687 -3.919163 -2.621445
H  -4.138997 -4.173436 -1.066552
H  -6.70271 -1.500867 -1.788844
H  -5.535825 -0.199566 -2.012294
H  -5.716069 -1.461297 -3.23239
H  3.416723 -2.173966 -1.420879
H  4.626809 -1.025341 -1.936966
H  5.746808 0.458653 1.990705
H  4.93425 -1.009336 2.477519
H  4.706467 -2.878099 0.485905
H  5.856807 -2.787227 -0.83312
H  6.554644 -0.509844 -0.059408
H  6.830758 -1.73318 1.164795
elementType: O N C H
totalener: -1094.86848596 hartree
nucrepener: 2052.98905004 hartree
electener: -3147.85753600 hartree
oneelecener: -5568.40326509 hartree
twoeener: 2420.54572910 hartree
cpcmener: -0.03817134 hartree
kineticenergy: 1090.04005947 hartree
xcener: -105.973541451754 hartree
chargesum: 0.0000000
charge: -0.288340 -0.485421 -0.438362 -0.435314 -0.093749 0.129065 -0.009503 -0.131975 -0.295859 -0.271594 -0.255542 0.440272 -0.042183 0.077887 -0.229629 -0.249758 -0.057709 -0.082514 -0.071189 -0.072224 -0.134179 -0.135985 0.335864 0.343950 0.099886 0.097274 0.093435 0.097228 0.103590 0.101050 0.097631 0.093425 0.124355 0.126274 0.142800 0.094880 0.095180 0.090326 0.096472 0.087116 0.102645 0.094222 0.101306 0.094320 0.102222 0.079235 0.080020 0.078521 0.080580
qa: -0.2883 -0.4854 -0.4384 -0.4353 -0.0937 0.1291 -0.0095 -0.1320 -0.2959 -0.2716 -0.2555 0.4403 -0.0422 0.0779 -0.2296 -0.2498 -0.0577 -0.0825 -0.0712 -0.0722 -0.1342 -0.1360 0.3359 0.3440 0.0999 0.0973 0.0934 0.0972 0.1036 0.1011 0.0976 0.0934 0.1244 0.1263 0.1428 0.0949 0.0952 0.0903 0.0965 0.0871 0.1026 0.0942 0.1013 0.0943 0.1022 0.0792 0.0800 0.0785 0.0806
va: 2.1067 2.0219 2.0731 2.0769 3.1041 3.6766 3.7942 3.8594 3.8999 3.9072 3.8593 4.1516 3.7071 3.8529 3.9274 3.9381 3.6812 3.7145 3.9208 3.9193 3.9153 3.9153 4.1959 4.1981 1.0248 1.0357 1.0172 1.0002 0.9996 1.0029 1.0009 1.0019 1.0062 1.0147 1.0162 0.9962 0.9951 1.0072 0.9979 1.0078 0.9986 1.0149 1.0052 1.0152 1.0052 1.0065 1.0099 1.0069 1.0094
dispcorr: -0.022628650 hartree
energy: -1094.891114606698
dipole: -22.61982 23.47212 0.85230 -16.18610 14.55243 -1.63367 -3.65524 4.22466 0.56942
magnitude: 1.92861 au
magnitude: 4.90213 debye
