program: Orca
programVersion: 5.0.2
elementType: O O O O N C C C C C C C C C C C C C C C C C C C H H H H H H H H H H H H H H H H H H H H H H H H H
charge: 0
multiplicity: 1
keywords: wb97x-d3
keywords: def2-TZVPP
keywords: def2/J RIJCOSX
keywords: DEFGRID2
keywords: scfconv7
keywords: smallprint printgap noloewdin
keywords: NOSOSCF
formula: C19H25NO4
InChI: InChI=1/C19H25NO4/c1-11(2)9-14-15(19(14,3)4)18(23)24-10-20-16(21)12-7-5-6-8-13(12)17(20)22/h9,14-15H,5-8,10H2,1-4H3
49 atoms
O  -0.225707 1.430707 0.007975
O  -1.468246 1.200129 -1.846864
O  3.098154 2.59803 1.083504
O  1.549011 -0.743924 -1.574258
N  2.045944 1.164031 -0.38661
C  -3.75558 0.920849 0.314667
C  -3.422079 -0.411672 -0.278834
C  -2.307403 0.449546 0.264533
C  -4.248757 2.012733 -0.600492
C  -4.369544 0.968354 1.691406
C  -3.753654 -1.69161 0.396164
C  -1.328976 1.048531 -0.656433
C  -4.841869 -2.420804 0.134529
C  0.889703 1.927092 -0.721273
C  -5.09673 -3.721809 0.831535
C  -5.887051 -2.01709 -0.86006
C  4.011992 0.418056 0.550576
C  3.551946 -0.570055 -0.218451
C  5.285617 0.384601 1.309856
C  4.213891 -1.882216 -0.411586
C  6.138821 -0.786581 0.818926
C  5.312188 -2.058678 0.638635
C  3.048075 1.545644 0.497619
C  2.276228 -0.13082 -0.832393
H  -3.477188 -0.432308 -1.363681
H  -1.895988 0.157929 1.224717
H  -3.874063 1.921356 -1.617488
H  -5.338651 1.975263 -0.652597
H  -3.973941 3.000103 -0.224461
H  -4.211656 1.946995 2.148226
H  -5.446723 0.799509 1.634738
H  -3.951522 0.218222 2.361869
H  -3.054399 -2.052052 1.145112
H  1.057458 2.963387 -0.436118
H  0.715888 1.882671 -1.793868
H  -4.306176 -3.972077 1.53857
H  -6.044017 -3.69531 1.375824
H  -5.177783 -4.540527 0.111883
H  -5.945016 -2.739486 -1.678454
H  -6.8742 -2.005148 -0.391537
H  -5.71468 -1.032893 -1.292831
H  5.81908 1.330781 1.193118
H  5.070593 0.288619 2.378576
H  3.47971 -2.688849 -0.348764
H  4.630544 -1.931589 -1.422359
H  6.601604 -0.518303 -0.134729
H  6.952133 -0.964795 1.522991
H  4.856025 -2.331382 1.594091
H  5.959801 -2.887894 0.352287
elementType: O N C H
totalener: -1094.86880831 hartree
nucrepener: 2048.39783533 hartree
electener: -3143.26664364 hartree
oneelecener: -5559.19533002 hartree
twoeener: 2415.92868638 hartree
cpcmener: -0.03823839 hartree
kineticenergy: 1090.03853942 hartree
xcener: -105.973113360816 hartree
chargesum: 0.0000000
charge: -0.286706 -0.484752 -0.434993 -0.438254 -0.094839 0.136721 -0.009148 -0.140554 -0.296130 -0.268660 -0.260489 0.442511 -0.038179 0.077295 -0.230363 -0.250643 -0.081113 -0.059102 -0.073359 -0.071170 -0.135317 -0.137158 0.344048 0.336586 0.099434 0.096451 0.093706 0.097577 0.102930 0.100407 0.097312 0.093045 0.124736 0.127286 0.141291 0.090159 0.094907 0.094984 0.101939 0.096000 0.087713 0.093845 0.102703 0.094387 0.102051 0.078958 0.081237 0.079048 0.081663
qa: -0.2867 -0.4848 -0.4350 -0.4383 -0.0948 0.1367 -0.0091 -0.1406 -0.2961 -0.2687 -0.2605 0.4425 -0.0382 0.0773 -0.2304 -0.2506 -0.0811 -0.0591 -0.0734 -0.0712 -0.1353 -0.1372 0.3440 0.3366 0.0994 0.0965 0.0937 0.0976 0.1029 0.1004 0.0973 0.0930 0.1247 0.1273 0.1413 0.0902 0.0949 0.0950 0.1019 0.0960 0.0877 0.0938 0.1027 0.0944 0.1021 0.0790 0.0812 0.0790 0.0817
va: 2.1068 2.0232 2.0772 2.0731 3.1053 3.6754 3.7850 3.8711 3.9015 3.9062 3.8631 4.1512 3.7025 3.8518 3.9275 3.9396 3.7134 3.6815 3.9194 3.9185 3.9140 3.9164 4.1987 4.1946 1.0249 1.0365 1.0170 1.0003 0.9998 1.0030 1.0016 1.0020 1.0064 1.0136 1.0175 1.0075 0.9961 0.9951 0.9981 0.9979 1.0076 1.0152 1.0048 1.0150 1.0047 1.0067 1.0094 1.0066 1.0092
dispcorr: -0.022471285 hartree
energy: -1094.891279599714
dipole: -22.60443 23.56847 0.96403 -14.31503 13.28947 -1.02556 6.80896 -5.53989 1.26907
magnitude: 1.89517 au
magnitude: 4.81714 debye
