program: Orca
programVersion: 5.0.2
elementType: O O O O N C C C C C C C C C C C C C C C C C C C H H H H H H H H H H H H H H H H H H H H H H H H H
charge: 0
multiplicity: 1
keywords: wb97x-d3
keywords: def2-TZVPP
keywords: def2/J RIJCOSX
keywords: DEFGRID2
keywords: scfconv7
keywords: smallprint printgap noloewdin
keywords: NOSOSCF
formula: C19H25NO4
InChI: InChI=1/C19H25NO4/c1-11(2)9-14-15(19(14,3)4)18(23)24-10-20-16(21)12-7-5-6-8-13(12)17(20)22/h9,14-15H,5-8,10H2,1-4H3
49 atoms
O  -0.381847 0.859523 -0.614297
O  -1.779077 1.914722 0.786395
O  2.875237 1.351606 -2.257931
O  1.428555 0.436085 1.947355
N  1.869249 1.170651 -0.188958
C  -2.792271 -1.052807 1.168825
C  -3.77966 -0.249889 0.395474
C  -2.330016 -0.258444 -0.04917
C  -2.403626 -0.605398 2.556436
C  -2.766869 -2.552479 1.002317
C  -4.824952 -0.873213 -0.456546
C  -1.509071 0.950525 0.108869
C  -5.404228 -0.278768 -1.502774
C  0.634724 1.838703 -0.435189
C  -6.483016 -0.957277 -2.289076
C  -5.041172 1.096515 -1.969655
C  3.895075 0.108818 -0.448487
C  3.470927 -0.167714 0.785829
C  5.187687 -0.333445 -1.025305
C  4.20665 -0.989377 1.776903
C  6.099194 -0.826789 0.098976
C  5.351893 -1.728071 1.0805
C  2.86928 0.937906 -1.125941
C  2.151671 0.480288 0.982582
H  -4.074881 0.679275 0.876365
H  -2.088525 -0.859588 -0.918224
H  -2.5343 0.462688 2.714472
H  -3.024162 -1.119783 3.292513
H  -1.362741 -0.855656 2.771695
H  -1.786195 -2.948552 1.271109
H  -3.502668 -3.022241 1.658089
H  -2.980393 -2.867195 -0.018917
H  -5.155657 -1.8708 -0.181842
H  0.402762 2.505106 0.392206
H  0.726645 2.427578 -1.345321
H  -7.394919 -0.355056 -2.304694
H  -6.182527 -1.087524 -3.331868
H  -6.731892 -1.937837 -1.884153
H  -4.851013 1.102107 -3.045078
H  -5.868722 1.790206 -1.801824
H  -4.162543 1.502468 -1.471608
H  5.006056 -1.129011 -1.754675
H  5.655429 0.483472 -1.57933
H  4.589718 -0.338353 2.569025
H  3.528356 -1.691888 2.26652
H  6.949901 -1.359777 -0.326821
H  6.50423 0.035329 0.636184
H  6.040728 -2.120085 1.829472
H  4.949744 -2.590529 0.542007
elementType: O N C H
totalener: -1094.86822228 hartree
nucrepener: 2076.44972745 hartree
electener: -3171.31794973 hartree
oneelecener: -5615.28179134 hartree
twoeener: 2443.96384161 hartree
cpcmener: -0.03626428 hartree
kineticenergy: 1090.04510340 hartree
xcener: -105.974517964184 hartree
chargesum: -0.0000000
charge: -0.284812 -0.486680 -0.434543 -0.442152 -0.096037 0.159161 -0.029399 -0.103717 -0.278155 -0.291560 -0.289785 0.408765 -0.014956 0.078907 -0.226916 -0.247053 -0.082211 -0.053199 -0.075018 -0.068505 -0.132607 -0.137815 0.347130 0.333392 0.103222 0.096404 0.093557 0.099074 0.095485 0.099101 0.100829 0.093763 0.125344 0.141660 0.126651 0.094996 0.096018 0.089557 0.095074 0.103579 0.080927 0.103049 0.093684 0.101714 0.094604 0.080454 0.078671 0.080984 0.079365
qa: -0.2848 -0.4867 -0.4345 -0.4422 -0.0960 0.1592 -0.0294 -0.1037 -0.2782 -0.2916 -0.2898 0.4088 -0.0150 0.0789 -0.2269 -0.2471 -0.0822 -0.0532 -0.0750 -0.0685 -0.1326 -0.1378 0.3471 0.3334 0.1032 0.0964 0.0936 0.0991 0.0955 0.0991 0.1008 0.0938 0.1253 0.1417 0.1267 0.0950 0.0960 0.0896 0.0951 0.1036 0.0809 0.1030 0.0937 0.1017 0.0946 0.0805 0.0787 0.0810 0.0794
va: 2.1031 2.0134 2.0771 2.0631 3.1060 3.7037 3.8313 3.8181 3.8831 3.9127 3.8846 4.1224 3.7069 3.8590 3.9273 3.9427 3.7171 3.6788 3.9191 3.9161 3.9134 3.9176 4.1930 4.1853 1.0248 1.0314 1.0162 1.0021 1.0055 1.0024 0.9989 1.0008 1.0025 1.0156 1.0135 0.9954 0.9965 1.0065 0.9995 0.9979 1.0135 1.0047 1.0156 1.0048 1.0150 1.0098 1.0067 1.0094 1.0064
dispcorr: -0.023061415 hartree
energy: -1094.891283694197
dipole: -16.32737 17.77525 1.44788 -14.75775 13.14515 -1.61261 0.52527 -0.77446 -0.24919
magnitude: 2.18150 au
magnitude: 5.54494 debye
