program: Orca
programVersion: 5.0.2
elementType: O O O O N C C C C C C C C C C C C C C C C C C C H H H H H H H H H H H H H H H H H H H H H H H H H
charge: 0
multiplicity: 1
keywords: wb97x-d3
keywords: def2-TZVPP
keywords: def2/J RIJCOSX
keywords: DEFGRID2
keywords: scfconv7
keywords: smallprint printgap noloewdin
keywords: NOSOSCF
formula: C19H25NO4
InChI: InChI=1/C19H25NO4/c1-11(2)9-14-15(19(14,3)4)18(23)24-10-20-16(21)12-7-5-6-8-13(12)17(20)22/h9,14-15H,5-8,10H2,1-4H3
49 atoms
O  -0.583983 2.032617 0.992392
O  -0.218431 -0.053145 1.714453
O  2.766348 0.580152 2.354684
O  1.129321 2.40689 -1.472525
N  1.740584 1.762146 0.653333
C  -2.332217 -0.328586 -0.721574
C  -2.829089 -0.900405 0.576786
C  -2.251182 0.48442 0.56294
C  -1.079238 -0.899188 -1.337908
C  -3.337907 0.142783 -1.740308
C  -4.276787 -1.084989 0.853579
C  -0.93397 0.751352 1.16682
C  -4.9524 -2.216937 0.638852
C  0.717809 2.443307 1.386187
C  -6.40871 -2.331834 0.969591
C  -4.331371 -3.450327 0.05992
C  3.301342 0.184652 0.031447
C  2.81642 0.71125 -1.093684
C  4.366578 -0.843902 0.103047
C  3.232706 0.328308 -2.463829
C  5.050259 -0.960866 -1.259996
C  4.038033 -0.970869 -2.403617
C  2.608524 0.81087 1.182653
C  1.798503 1.726592 -0.734274
H  -2.176699 -1.658166 1.002366
H  -2.947047 1.315914 0.615747
H  -0.381294 -1.299912 -0.604264
H  -1.340752 -1.715394 -2.014092
H  -0.553699 -0.14438 -1.92757
H  -2.892443 0.883011 -2.407568
H  -3.676892 -0.694162 -2.354891
H  -4.217428 0.59447 -1.282151
H  -4.812672 -0.233062 1.262531
H  0.88692 2.286845 2.451042
H  0.745848 3.510015 1.181043
H  -6.584055 -3.133127 1.692168
H  -6.810179 -1.408849 1.387477
H  -6.993611 -2.585392 0.081807
H  -4.396673 -4.284839 0.762925
H  -4.870245 -3.763359 -0.837833
H  -3.28465 -3.320131 -0.210089
H  5.087869 -0.588042 0.882446
H  3.926241 -1.80074 0.400502
H  2.356733 0.215126 -3.107281
H  3.82817 1.135621 -2.901825
H  5.735485 -0.118796 -1.390938
H  5.657557 -1.866162 -1.287188
H  3.352025 -1.812247 -2.271966
H  4.547228 -1.128432 -3.354961
elementType: O N C H
totalener: -1094.86785194 hartree
nucrepener: 2146.01347922 hartree
electener: -3240.88133116 hartree
oneelecener: -5754.61333529 hartree
twoeener: 2513.73200413 hartree
cpcmener: -0.03954708 hartree
kineticenergy: 1090.05210726 hartree
xcener: -105.975659742870 hartree
chargesum: 0.0000000
charge: -0.278703 -0.473807 -0.428812 -0.433273 -0.101393 0.148492 -0.022004 -0.125294 -0.296550 -0.277297 -0.265451 0.413230 -0.037978 0.084844 -0.229684 -0.249159 -0.031619 -0.088304 -0.069365 -0.077795 -0.136708 -0.133702 0.314602 0.319268 0.100813 0.102621 0.092687 0.105531 0.094858 0.101391 0.098423 0.093575 0.123617 0.135921 0.146091 0.094957 0.089702 0.094435 0.102095 0.096749 0.087262 0.094084 0.102640 0.094850 0.104822 0.078221 0.081007 0.079106 0.081005
qa: -0.2787 -0.4738 -0.4288 -0.4333 -0.1014 0.1485 -0.0220 -0.1253 -0.2966 -0.2773 -0.2655 0.4132 -0.0380 0.0848 -0.2297 -0.2492 -0.0316 -0.0883 -0.0694 -0.0778 -0.1367 -0.1337 0.3146 0.3193 0.1008 0.1026 0.0927 0.1055 0.0949 0.1014 0.0984 0.0936 0.1236 0.1359 0.1461 0.0950 0.0897 0.0944 0.1021 0.0967 0.0873 0.0941 0.1026 0.0949 0.1048 0.0782 0.0810 0.0791 0.0810
va: 2.1121 2.0341 2.0797 2.0677 3.0808 3.6792 3.8162 3.8363 3.8975 3.8993 3.8542 4.2096 3.7055 3.8864 3.9275 3.9361 3.6341 3.7092 3.9073 3.9168 3.9189 3.9129 4.1960 4.1636 1.0232 1.0320 1.0130 1.0022 1.0083 1.0032 1.0005 1.0018 1.0060 1.0137 0.9921 0.9951 1.0073 0.9963 0.9983 0.9977 1.0081 1.0153 1.0053 1.0137 1.0049 1.0064 1.0093 1.0075 1.0095
dispcorr: -0.025637824 hartree
energy: -1094.893489762549
dipole: -18.26508 18.51422 0.24915 -20.58023 20.00220 -0.57803 -13.40231 11.77406 -1.62825
magnitude: 1.74568 au
magnitude: 4.43717 debye
