program: Orca
programVersion: 5.0.2
elementType: O O O O N C C C C C C C C C C C C C C C C C C C H H H H H H H H H H H H H H H H H H H H H H H H H
charge: 0
multiplicity: 1
keywords: wb97x-d3
keywords: def2-TZVPP
keywords: def2/J RIJCOSX
keywords: DEFGRID2
keywords: scfconv7
keywords: smallprint printgap noloewdin
keywords: NOSOSCF
formula: C19H25NO4
InChI: InChI=1/C19H25NO4/c1-11(2)9-14-15(19(14,3)4)18(23)24-10-20-16(21)12-7-5-6-8-13(12)17(20)22/h9,14-15H,5-8,10H2,1-4H3
49 atoms
O  -0.52341 1.861395 1.101683
O  -0.665569 1.538384 -1.108174
O  1.636502 0.106445 2.50737
O  2.347247 2.146224 -1.493824
N  1.752214 1.420591 0.618403
C  -3.710191 1.065751 -0.536229
C  -3.03296 -0.2664 -0.485657
C  -2.475212 0.896843 0.329999
C  -3.655083 1.845127 -1.827645
C  -4.999426 1.286328 0.21877
C  -3.577536 -1.426385 0.243189
C  -1.159256 1.453581 -0.008361
C  -3.493307 -2.71163 -0.116949
C  0.78232 2.40558 0.980828
C  -4.067533 -3.78584 0.757861
C  -2.836389 -3.215117 -1.365283
C  3.006106 -0.513797 0.606789
C  3.204288 0.083329 -0.568915
C  3.635622 -1.787054 1.033793
C  4.074813 -0.431697 -1.652952
C  4.789637 -2.127895 0.089011
C  4.419607 -1.895676 -1.375161
C  2.066082 0.314866 1.399752
C  2.409093 1.335125 -0.604784
H  -2.450354 -0.493717 -1.371904
H  -2.676146 0.85294 1.394188
H  -2.801357 1.590723 -2.450935
H  -4.554841 1.635682 -2.409054
H  -3.6306 2.919983 -1.639174
H  -5.165044 2.353664 0.37538
H  -5.846403 0.900878 -0.351828
H  -5.009751 0.808747 1.197139
H  -4.077886 -1.202558 1.180845
H  1.006869 2.80915 1.964619
H  0.818027 3.217247 0.255081
H  -4.827158 -4.363337 0.224893
H  -3.294486 -4.497702 1.058582
H  -4.522886 -3.382341 1.66183
H  -2.507209 -2.429654 -2.041939
H  -1.96514 -3.827831 -1.120021
H  -3.518993 -3.863267 -1.919504
H  3.985085 -1.712739 2.066021
H  2.881264 -2.580178 1.026423
H  3.580477 -0.323837 -2.621066
H  4.982154 0.177921 -1.707583
H  5.657112 -1.513552 0.345052
H  5.086934 -3.166415 0.238332
H  3.561736 -2.521716 -1.635311
H  5.241248 -2.205285 -2.021763
elementType: O N C H
totalener: -1094.86975820 hartree
nucrepener: 2110.58597549 hartree
electener: -3205.45573369 hartree
oneelecener: -5683.91867716 hartree
twoeener: 2478.46294347 hartree
cpcmener: -0.04099393 hartree
kineticenergy: 1090.04168069 hartree
xcener: -105.975112946740 hartree
chargesum: 0.0000000
charge: -0.287874 -0.491823 -0.435293 -0.430519 -0.104247 0.107297 0.037880 -0.107431 -0.276617 -0.274295 -0.279816 0.434989 -0.050805 0.085257 -0.217244 -0.254442 -0.076244 -0.066695 -0.070867 -0.078400 -0.137736 -0.133377 0.335448 0.337305 0.099631 0.088865 0.090978 0.095998 0.099799 0.097334 0.098317 0.090959 0.120474 0.146873 0.133549 0.094145 0.093456 0.088440 0.090954 0.098905 0.095186 0.093661 0.102663 0.093833 0.102472 0.078468 0.081068 0.078582 0.080940
qa: -0.2879 -0.4918 -0.4353 -0.4305 -0.1042 0.1073 0.0379 -0.1074 -0.2766 -0.2743 -0.2798 0.4350 -0.0508 0.0853 -0.2172 -0.2544 -0.0762 -0.0667 -0.0709 -0.0784 -0.1377 -0.1334 0.3354 0.3373 0.0996 0.0889 0.0910 0.0960 0.0998 0.0973 0.0983 0.0910 0.1205 0.1469 0.1335 0.0941 0.0935 0.0884 0.0910 0.0989 0.0952 0.0937 0.1027 0.0938 0.1025 0.0785 0.0811 0.0786 0.0809
va: 2.1119 2.0167 2.0744 2.0787 3.0874 3.6867 3.7813 3.8221 3.8995 3.9145 3.8837 4.1270 3.7624 3.8869 3.9188 3.9395 3.7018 3.6670 3.9156 3.9181 3.9184 3.9156 4.1893 4.1844 1.0261 1.0374 1.0200 0.9997 0.9996 1.0014 1.0012 1.0063 1.0113 0.9936 1.0158 0.9964 0.9958 1.0091 1.0104 0.9961 0.9972 1.0153 1.0045 1.0154 1.0042 1.0064 1.0093 1.0065 1.0094
dispcorr: -0.022617779 hartree
energy: -1094.892375979064
dipole: -18.30040 18.63392 0.33352 -19.40800 17.98106 -1.42694 -6.47791 6.78269 0.30478
magnitude: 1.49676 au
magnitude: 3.80446 debye
