program: Orca
programVersion: 5.0.2
elementType: O O O O N C C C C C C C C C C C C C C C C C C C H H H H H H H H H H H H H H H H H H H H H H H H H
charge: 0
multiplicity: 1
keywords: wb97x-d3
keywords: def2-TZVPP
keywords: def2/J RIJCOSX
keywords: DEFGRID2
keywords: scfconv7
keywords: smallprint printgap noloewdin
keywords: NOSOSCF
formula: C19H25NO4
InChI: InChI=1/C19H25NO4/c1-11(2)9-14-15(19(14,3)4)18(23)24-10-20-16(21)12-7-5-6-8-13(12)17(20)22/h9,14-15H,5-8,10H2,1-4H3
49 atoms
O  -0.092027 -1.288258 0.116112
O  -1.337435 -1.50216 -1.735684
O  1.555676 0.711347 -1.696961
O  3.251303 -2.123979 1.41855
N  2.162038 -0.987874 -0.268609
C  -2.753368 0.99725 -0.44428
C  -3.619166 -0.219533 -0.307298
C  -2.173921 -0.280267 0.14418
C  -2.356742 1.447589 -1.828915
C  -2.915791 2.149095 0.518054
C  -4.69702 -0.310877 0.696109
C  -1.196183 -1.079005 -0.615043
C  -5.917244 -0.82753 0.515184
C  1.055896 -1.85428 -0.503976
C  -6.921592 -0.818904 1.628872
C  -6.416284 -1.430888 -0.762553
C  3.484814 0.897269 -0.239523
C  3.984583 0.058406 0.669184
C  4.033315 2.238343 -0.556558
C  5.19061 0.313224 1.493623
C  5.028841 2.651767 0.528818
C  5.959823 1.504144 0.918045
C  2.293892 0.263248 -0.857034
C  3.137029 -1.160191 0.706694
H  -3.805625 -0.729206 -1.246248
H  -1.996214 -0.246504 1.213586
H  -2.377617 0.647675 -2.565739
H  -3.048005 2.220253 -2.171733
H  -1.354142 1.881195 -1.830289
H  -3.7533 2.782908 0.218878
H  -3.092482 1.829954 1.544411
H  -2.017649 2.769999 0.520709
H  -4.468706 0.095237 1.677239
H  0.905711 -1.988127 -1.573356
H  1.262618 -2.822367 -0.051261
H  -6.53685 -0.339392 2.529092
H  -7.832194 -0.291586 1.331081
H  -7.227558 -1.835001 1.892725
H  -5.648857 -1.556389 -1.523817
H  -6.85961 -2.412052 -0.576134
H  -7.209119 -0.813827 -1.194177
H  4.517816 2.208537 -1.537959
H  3.224595 2.968014 -0.643593
H  4.88708 0.509175 2.52724
H  5.821369 -0.578273 1.530573
H  5.612352 3.50607 0.182805
H  4.47842 2.986719 1.412772
H  6.695461 1.848974 1.646111
H  6.520755 1.177864 0.037524
elementType: O N C H
totalener: -1094.87976484 hartree
nucrepener: 2062.14849097 hartree
electener: -3157.02825581 hartree
oneelecener: -5586.58494193 hartree
twoeener: 2429.55668612 hartree
cpcmener: -0.03067217 hartree
kineticenergy: 1090.03953749 hartree
xcener: -105.971364863479 hartree
chargesum: 0.0000000
charge: -0.281954 -0.454242 -0.414677 -0.408632 -0.096215 0.103533 0.030498 -0.081516 -0.273888 -0.273280 -0.273152 0.383165 -0.048895 0.083294 -0.216451 -0.253224 -0.053160 -0.084458 -0.070397 -0.074210 -0.135712 -0.135368 0.311721 0.324743 0.094581 0.090201 0.093775 0.097311 0.093122 0.097988 0.088283 0.097109 0.115236 0.139271 0.124752 0.087099 0.091926 0.093290 0.090487 0.092708 0.098736 0.100083 0.093779 0.101295 0.093527 0.080900 0.078281 0.080383 0.078352
qa: -0.2820 -0.4542 -0.4147 -0.4086 -0.0962 0.1035 0.0305 -0.0815 -0.2739 -0.2733 -0.2732 0.3832 -0.0489 0.0833 -0.2165 -0.2532 -0.0532 -0.0845 -0.0704 -0.0742 -0.1357 -0.1354 0.3117 0.3247 0.0946 0.0902 0.0938 0.0973 0.0931 0.0980 0.0883 0.0971 0.1152 0.1393 0.1248 0.0871 0.0919 0.0933 0.0905 0.0927 0.0987 0.1001 0.0938 0.1013 0.0935 0.0809 0.0783 0.0804 0.0784
va: 2.1056 2.0571 2.0970 2.1100 3.0949 3.6932 3.7967 3.8095 3.9014 3.9126 3.8805 4.1935 3.7673 3.8555 3.9214 3.9393 3.6551 3.6983 3.9184 3.9201 3.9150 3.9137 4.2141 4.2239 1.0281 1.0341 1.0177 1.0011 1.0064 1.0015 1.0069 1.0015 1.0119 1.0172 1.0138 1.0091 0.9956 0.9967 1.0108 0.9974 0.9962 1.0050 1.0153 1.0051 1.0156 1.0093 1.0067 1.0096 1.0067
dispcorr: -0.022424717 hartree
energy: -1094.902189556960
dipole: -22.02621 23.06524 1.03903 13.79452 -12.27906 1.51546 3.84395 -2.84763 0.99632
magnitude: 2.09018 au
magnitude: 5.31282 debye
