program: Orca
programVersion: 5.0.2
elementType: O O O O N C C C C C C C C C C C C C C C C C C C H H H H H H H H H H H H H H H H H H H H H H H H H
charge: 0
multiplicity: 1
keywords: wb97x-d3
keywords: def2-TZVPP
keywords: def2/J RIJCOSX
keywords: DEFGRID2
keywords: scfconv7
keywords: smallprint printgap noloewdin
keywords: NOSOSCF
formula: C19H25NO4
InChI: InChI=1/C19H25NO4/c1-11(2)9-14-15(19(14,3)4)18(23)24-10-20-16(21)12-7-5-6-8-13(12)17(20)22/h9,14-15H,5-8,10H2,1-4H3
49 atoms
O  -0.515692 1.670528 1.243152
O  -0.623251 1.4307 -0.976015
O  2.386615 2.166486 -1.313396
O  1.714983 -0.109211 2.565425
N  1.765203 1.282816 0.731656
C  -3.692948 1.133611 -0.437793
C  -3.093481 -0.232264 -0.565507
C  -2.475017 0.772741 0.395411
C  -3.57528 2.078154 -1.608735
C  -4.979204 1.319164 0.331591
C  -3.736306 -1.441982 -0.020426
C  -1.13594 1.313427 0.109671
C  -3.816973 -2.639559 -0.610555
C  0.785113 2.231575 1.153279
C  -4.513553 -3.780469 0.068979
C  -3.258308 -2.973118 -1.959946
C  3.32543 0.101211 -0.480989
C  3.132483 -0.569137 0.655281
C  4.265694 -0.294926 -1.557403
C  3.805668 -1.838933 1.02211
C  5.211505 -1.37889 -1.036757
C  4.471822 -2.436574 -0.218588
C  2.460885 1.308291 -0.473796
C  2.138257 0.169233 1.472531
H  -2.518262 -0.371131 -1.474408
H  -2.675896 0.61084 1.448638
H  -4.465537 1.991546 -2.235105
H  -3.511699 3.115605 -1.273139
H  -2.714447 1.875581 -2.24128
H  -5.029256 0.715112 1.236673
H  -5.094856 2.362772 0.630963
H  -5.837807 1.057241 -0.290319
H  -4.186014 -1.339043 0.962806
H  1.006775 2.579007 2.159738
H  0.809748 3.084387 0.474994
H  -5.342936 -4.152574 -0.538801
H  -3.834291 -4.625404 0.211906
H  -4.911821 -3.501211 1.044535
H  -4.060089 -3.257004 -2.647018
H  -2.702769 -2.160401 -2.423632
H  -2.590335 -3.836081 -1.896437
H  3.695501 -0.656824 -2.419266
H  4.824967 0.574017 -1.912843
H  4.54583 -1.644075 1.805009
H  3.086837 -2.538485 1.455838
H  5.728084 -1.846893 -1.876048
H  5.982767 -0.915696 -0.414541
H  5.161386 -3.226742 0.081981
H  3.708198 -2.90858 -0.843758
elementType: O N C H
totalener: -1094.88024009 hartree
nucrepener: 2097.68860049 hartree
electener: -3192.56884058 hartree
oneelecener: -5658.04932633 hartree
twoeener: 2465.48048575 hartree
cpcmener: -0.03307810 hartree
kineticenergy: 1090.03985404 hartree
xcener: -105.972023521779 hartree
chargesum: -0.0000000
charge: -0.284277 -0.463576 -0.402457 -0.410623 -0.100813 0.100380 0.040655 -0.109564 -0.274643 -0.271505 -0.271909 0.416414 -0.051180 0.086770 -0.217007 -0.251195 -0.068915 -0.085223 -0.074136 -0.075208 -0.136498 -0.135304 0.321924 0.315428 0.095908 0.086922 0.094461 0.097522 0.093489 0.088469 0.097221 0.097886 0.116214 0.143929 0.131435 0.092653 0.092942 0.087634 0.096682 0.089575 0.093917 0.101659 0.093215 0.100319 0.093329 0.080675 0.077674 0.080332 0.078399
qa: -0.2843 -0.4636 -0.4025 -0.4106 -0.1008 0.1004 0.0407 -0.1096 -0.2746 -0.2715 -0.2719 0.4164 -0.0512 0.0868 -0.2170 -0.2512 -0.0689 -0.0852 -0.0741 -0.0752 -0.1365 -0.1353 0.3219 0.3154 0.0959 0.0869 0.0945 0.0975 0.0935 0.0885 0.0972 0.0979 0.1162 0.1439 0.1314 0.0927 0.0929 0.0876 0.0967 0.0896 0.0939 0.1017 0.0932 0.1003 0.0933 0.0807 0.0777 0.0803 0.0784
va: 2.1161 2.0480 2.1143 2.1072 3.0760 3.6916 3.7749 3.8254 3.9026 3.9144 3.8801 4.1612 3.7714 3.8851 3.9201 3.9403 3.6508 3.6870 3.9195 3.9221 3.9147 3.9140 4.2159 4.2194 1.0289 1.0366 0.9999 0.9997 1.0204 1.0069 1.0017 1.0015 1.0119 0.9938 1.0173 0.9959 0.9967 1.0092 0.9968 1.0113 0.9972 1.0047 1.0162 1.0047 1.0156 1.0093 1.0066 1.0093 1.0067
dispcorr: -0.022474159 hartree
energy: -1094.902714249974
dipole: -19.21093 19.54275 0.33182 -17.42539 16.22893 -1.19646 -8.72941 8.87246 0.14305
magnitude: 1.24984 au
magnitude: 3.17683 debye
