program: Orca
programVersion: 5.0.2
elementType: O O O O N C C C C C C C C C C C C C C C C C C C H H H H H H H H H H H H H H H H H H H H H H H H H
charge: 0
multiplicity: 1
keywords: wb97x-d3
keywords: def2-TZVPP
keywords: def2/J RIJCOSX
keywords: DEFGRID2
keywords: scfconv7
keywords: smallprint printgap noloewdin
keywords: NOSOSCF
formula: C19H25NO4
InChI: InChI=1/C19H25NO4/c1-11(2)9-14-15(19(14,3)4)18(23)24-10-20-16(21)12-7-5-6-8-13(12)17(20)22/h9,14-15H,5-8,10H2,1-4H3
49 atoms
O  -0.681457 1.682248 1.406742
O  -0.529191 1.832128 -0.817837
O  2.496195 2.390477 -0.724678
O  1.133439 -0.614992 2.403724
N  1.591678 1.165883 1.015827
C  -3.595402 1.230954 -0.824605
C  -2.868931 -0.064488 -0.892587
C  -2.508401 0.942598 0.197159
C  -3.377698 2.248663 -1.917739
C  -4.997188 1.260676 -0.263475
C  -3.46459 -1.369353 -0.512346
C  -1.167108 1.538658 0.164143
C  -2.756134 -2.415479 -0.077483
C  0.664149 2.109053 1.556645
C  -3.413594 -3.713382 0.277758
C  -1.270135 -2.375474 0.116759
C  3.016244 0.052857 -0.411453
C  2.625001 -0.829771 0.507866
C  3.95113 -0.230067 -1.526773
C  3.038093 -2.253352 0.553293
C  4.64801 -1.569561 -1.282574
C  3.67635 -2.638354 -0.783064
C  2.367386 1.356389 -0.124732
C  1.701285 -0.149454 1.44859
H  -2.123006 -0.11229 -1.682529
H  -2.867128 0.702041 1.191148
H  -3.457415 3.266637 -1.531007
H  -2.413261 2.150515 -2.409671
H  -4.14687 2.128745 -2.683569
H  -5.725759 0.99721 -1.03305
H  -5.133226 0.574442 0.572429
H  -5.243345 2.263053 0.092075
H  -4.541427 -1.473655 -0.610206
H  0.805864 2.208688 2.630318
H  0.837566 3.077654 1.087838
H  -3.184112 -3.999679 1.307773
H  -4.49781 -3.668297 0.17502
H  -3.048211 -4.526144 -0.355533
H  -1.022074 -2.38109 1.181516
H  -0.798115 -3.261838 -0.312996
H  -0.79933 -1.500084 -0.327249
H  3.392595 -0.247222 -2.468193
H  4.680154 0.577901 -1.625955
H  3.7423 -2.402079 1.378247
H  2.177535 -2.890489 0.773264
H  5.129944 -1.90284 -2.202712
H  5.444364 -1.43186 -0.545585
H  4.192623 -3.593704 -0.679844
H  2.888265 -2.787186 -1.526835
elementType: O N C H
totalener: -1094.87779148 hartree
nucrepener: 2177.33670768 hartree
electener: -3272.21449916 hartree
oneelecener: -5817.20048779 hartree
twoeener: 2544.98598863 hartree
cpcmener: -0.03152886 hartree
kineticenergy: 1090.05312087 hartree
xcener: -105.973812899466 hartree
chargesum: -0.0000000
charge: -0.282573 -0.465142 -0.401013 -0.409596 -0.098264 0.169686 -0.030034 -0.086524 -0.280117 -0.289490 -0.301859 0.372652 0.014540 0.092036 -0.229996 -0.258597 -0.043308 -0.078187 -0.069082 -0.082302 -0.138214 -0.133077 0.308542 0.286002 0.104936 0.090201 0.098777 0.094221 0.092939 0.099326 0.091869 0.097359 0.122594 0.141238 0.130946 0.094369 0.089332 0.096433 0.101883 0.099215 0.079171 0.100981 0.093315 0.104893 0.092173 0.081288 0.077821 0.080466 0.078174
qa: -0.2826 -0.4651 -0.4010 -0.4096 -0.0983 0.1697 -0.0300 -0.0865 -0.2801 -0.2895 -0.3019 0.3727 0.0145 0.0920 -0.2300 -0.2586 -0.0433 -0.0782 -0.0691 -0.0823 -0.1382 -0.1331 0.3085 0.2860 0.1049 0.0902 0.0988 0.0942 0.0929 0.0993 0.0919 0.0974 0.1226 0.1412 0.1309 0.0944 0.0893 0.0964 0.1019 0.0992 0.0792 0.1010 0.0933 0.1049 0.0922 0.0813 0.0778 0.0805 0.0782
va: 2.1093 2.0393 2.1156 2.0981 3.0751 3.7015 3.8301 3.7924 3.8809 3.9137 3.8950 4.1680 3.7139 3.8904 3.9313 3.9495 3.6343 3.6636 3.9118 3.9208 3.9166 3.9131 4.2143 4.2090 1.0226 1.0340 0.9997 1.0204 1.0009 0.9990 1.0012 1.0029 1.0042 0.9926 1.0162 0.9957 1.0064 0.9962 1.0024 0.9998 1.0081 1.0053 1.0157 1.0045 1.0129 1.0094 1.0063 1.0097 1.0074
dispcorr: -0.025844007 hartree
energy: -1094.903635487156
dipole: -14.71829 15.00092 0.28263 -17.02569 15.50600 -1.51969 -8.63555 8.67022 0.03467
magnitude: 1.54614 au
magnitude: 3.92997 debye
