program: Orca
programVersion: 5.0.2
elementType: O O O O N C C C C C C C C C C C C C C C C C C C H H H H H H H H H H H H H H H H H H H H H H H H H
charge: 0
multiplicity: 1
keywords: wb97x-d3
keywords: def2-TZVPP
keywords: def2/J RIJCOSX
keywords: DEFGRID2
keywords: scfconv7
keywords: smallprint printgap noloewdin
keywords: NOSOSCF
formula: C19H25NO4
InChI: InChI=1/C19H25NO4/c1-11(2)9-14-15(19(14,3)4)18(23)24-10-20-16(21)12-7-5-6-8-13(12)17(20)22/h9,14-15H,5-8,10H2,1-4H3
49 atoms
O  -0.605081 1.189748 1.510759
O  -0.253145 -1.002593 1.237611
O  2.805508 -0.671914 1.98177
O  1.105972 2.787418 -0.430199
N  1.708772 1.147736 1.073046
C  -2.290996 -0.19527 -1.132072
C  -2.833398 -1.241465 -0.213535
C  -2.243076 0.014401 0.376214
C  -1.018022 -0.478066 -1.892483
C  -3.243878 0.701647 -1.882191
C  -4.290017 -1.513132 -0.090275
C  -0.95029 -0.030711 1.080203
C  -4.893351 -1.936582 1.02334
C  0.693882 1.372214 2.054582
C  -6.365371 -2.212667 1.058812
C  -4.169046 -2.170424 2.313069
C  3.304963 0.133754 -0.24284
C  2.82571 1.162637 -0.942034
C  4.342562 -0.812163 -0.720416
C  3.263114 1.549312 -2.30502
C  4.519035 -0.651188 -2.231596
C  4.56146 0.817718 -2.650392
C  2.615998 0.091896 1.072022
C  1.782777 1.836917 -0.131113
H  -2.194523 -2.115201 -0.108065
H  -2.93475 0.760955 0.752018
H  -0.348272 -1.160949 -1.371998
H  -1.255713 -0.933014 -2.856251
H  -0.469572 0.445145 -2.093891
H  -2.758236 1.645889 -2.136242
H  -3.561249 0.23392 -2.81679
H  -4.139421 0.938682 -1.307692
H  -4.89155 -1.378988 -0.985132
H  0.876027 0.716437 2.905809
H  0.710855 2.404486 2.395783
H  -6.861494 -1.597758 1.814585
H  -6.845152 -2.017892 0.099472
H  -6.564028 -3.252941 1.329845
H  -4.579408 -1.540498 3.107166
H  -4.298456 -3.203876 2.645426
H  -3.09997 -1.974388 2.250569
H  5.283457 -0.617505 -0.195674
H  4.064957 -1.838294 -0.468013
H  2.472505 1.298277 -3.019914
H  3.394513 2.632003 -2.371802
H  5.432087 -1.157202 -2.548439
H  3.691518 -1.149473 -2.744878
H  4.75087 0.896216 -3.721846
H  5.397634 1.313121 -2.148526
elementType: O N C H
totalener: -1094.87744512 hartree
nucrepener: 2150.69057962 hartree
electener: -3245.56802474 hartree
oneelecener: -5763.85484141 hartree
twoeener: 2518.28681667 hartree
cpcmener: -0.03167996 hartree
kineticenergy: 1090.04560664 hartree
xcener: -105.971624661632 hartree
chargesum: -0.0000000
charge: -0.275560 -0.452719 -0.400970 -0.407981 -0.099056 0.165813 -0.022399 -0.122050 -0.282664 -0.291768 -0.291865 0.387539 -0.019452 0.084517 -0.228294 -0.237690 -0.039273 -0.094873 -0.073771 -0.066604 -0.135341 -0.136911 0.301314 0.299980 0.104924 0.098234 0.093363 0.104251 0.091523 0.098737 0.099386 0.093072 0.122639 0.133056 0.142882 0.093981 0.089220 0.095250 0.096421 0.099880 0.078107 0.099815 0.093604 0.100171 0.093922 0.080979 0.078356 0.080898 0.077409
qa: -0.2756 -0.4527 -0.4010 -0.4080 -0.0991 0.1658 -0.0224 -0.1221 -0.2827 -0.2918 -0.2919 0.3875 -0.0195 0.0845 -0.2283 -0.2377 -0.0393 -0.0949 -0.0738 -0.0666 -0.1353 -0.1369 0.3013 0.3000 0.1049 0.0982 0.0934 0.1043 0.0915 0.0987 0.0994 0.0931 0.1226 0.1331 0.1429 0.0940 0.0892 0.0952 0.0964 0.0999 0.0781 0.0998 0.0936 0.1002 0.0939 0.0810 0.0784 0.0809 0.0774
va: 2.1179 2.0488 2.1152 2.1025 3.0645 3.7093 3.8350 3.8047 3.8878 3.9027 3.8867 4.1870 3.7148 3.8923 3.9296 3.9336 3.6204 3.6955 3.9150 3.9198 3.9136 3.9175 4.2163 4.1972 1.0240 1.0293 1.0136 1.0025 1.0061 1.0034 0.9990 1.0016 1.0026 1.0149 0.9926 0.9967 1.0063 0.9961 0.9989 0.9997 1.0206 1.0046 1.0155 1.0064 1.0157 1.0094 1.0073 1.0095 1.0063
dispcorr: -0.025479630 hartree
energy: -1094.902924750479
dipole: -17.60038 17.85709 0.25670 -9.91167 10.23086 0.31919 -13.01046 11.72523 -1.28524
magnitude: 1.34893 au
magnitude: 3.42871 debye
