program: Orca
programVersion: 5.0.2
elementType: O O O O N C C C C C C C C C C C C C C C C C C C H H H H H H H H H H H H H H H H H H H H H H H H H
charge: 0
multiplicity: 1
keywords: wb97x-d3
keywords: def2-TZVPP
keywords: def2/J RIJCOSX
keywords: DEFGRID2
keywords: scfconv7
keywords: smallprint printgap noloewdin
keywords: NOSOSCF
formula: C19H25NO4
InChI: InChI=1/C19H25NO4/c1-11(2)9-14-15(19(14,3)4)18(23)24-10-20-16(21)12-7-5-6-8-13(12)17(20)22/h9,14-15H,5-8,10H2,1-4H3
49 atoms
O  -0.528576 1.494924 0.401892
O  -1.534331 2.312709 2.225614
O  2.332897 1.850998 -1.702179
O  1.623333 0.016469 2.390391
N  1.762258 1.249241 0.450837
C  -3.466222 0.982302 -0.476843
C  -2.717909 -0.283309 -0.178445
C  -2.739284 0.819434 0.849882
C  -2.932654 1.91297 -1.538888
C  -4.97267 0.973241 -0.398077
C  -3.405692 -1.563599 0.130743
C  -1.561226 1.618103 1.237703
C  -3.717311 -2.497535 -0.771312
C  0.696444 2.155061 0.703369
C  -4.379348 -3.779782 -0.369286
C  -3.435643 -2.354995 -2.235314
C  3.393535 -0.009987 -0.573627
C  3.186283 -0.552234 0.627294
C  4.383339 -0.489792 -1.56797
C  3.919915 -1.719141 1.175331
C  4.883435 -1.878641 -1.16482
C  5.171318 -1.973293 0.333197
C  2.468956 1.139523 -0.740876
C  2.115985 0.215007 1.310119
H  -1.785981 -0.384792 -0.726757
H  -3.401266 0.665661 1.696024
H  -1.861748 1.812579 -1.703384
H  -3.424863 1.702628 -2.490889
H  -3.139901 2.956305 -1.29134
H  -5.35671 1.983182 -0.240638
H  -5.402467 0.599376 -1.330249
H  -5.347604 0.347119 0.411158
H  -3.657855 -1.746617 1.171661
H  0.72676 2.480025 1.741313
H  0.802229 3.024397 0.056468
H  -4.548821 -3.836368 0.706074
H  -5.344002 -3.899208 -0.869924
H  -3.773685 -4.642773 -0.659453
H  -3.017026 -1.38529 -2.501227
H  -2.737477 -3.125235 -2.575051
H  -4.350113 -2.493132 -2.818264
H  3.942162 -0.507741 -2.567484
H  5.213757 0.222063 -1.619543
H  4.181793 -1.547249 2.222069
H  3.261945 -2.594187 1.169772
H  4.131079 -2.62447 -1.436642
H  5.7821 -2.121282 -1.733719
H  5.938408 -1.241232 0.601748
H  5.580025 -2.955687 0.573574
elementType: O N C H
totalener: -1094.87698662 hartree
nucrepener: 2094.98402744 hartree
electener: -3189.86101406 hartree
oneelecener: -5651.79551305 hartree
twoeener: 2461.93449898 hartree
cpcmener: -0.03160462 hartree
kineticenergy: 1090.04549739 hartree
xcener: -105.970791445416 hartree
chargesum: -0.0000000
charge: -0.273639 -0.457648 -0.411226 -0.407958 -0.103821 0.122177 0.021690 -0.144243 -0.291853 -0.274209 -0.270912 0.419714 -0.035878 0.073623 -0.229197 -0.250450 -0.077529 -0.057811 -0.072098 -0.073132 -0.135750 -0.134603 0.320723 0.310862 0.105760 0.092050 0.091692 0.094561 0.104731 0.101250 0.095211 0.091844 0.120271 0.139471 0.129013 0.089412 0.093999 0.093977 0.086908 0.102136 0.094899 0.093576 0.100806 0.093186 0.101453 0.077975 0.080424 0.077582 0.080978
qa: -0.2736 -0.4576 -0.4112 -0.4080 -0.1038 0.1222 0.0217 -0.1442 -0.2919 -0.2742 -0.2709 0.4197 -0.0359 0.0736 -0.2292 -0.2505 -0.0775 -0.0578 -0.0721 -0.0731 -0.1357 -0.1346 0.3207 0.3109 0.1058 0.0921 0.0917 0.0946 0.1047 0.1013 0.0952 0.0918 0.1203 0.1395 0.1290 0.0894 0.0940 0.0940 0.0869 0.1021 0.0949 0.0936 0.1008 0.0932 0.1015 0.0780 0.0804 0.0776 0.0810
va: 2.0890 2.0532 2.1042 2.1088 3.1174 3.6879 3.7602 3.8953 3.9014 3.9083 3.8471 4.1751 3.7080 3.8472 3.9290 3.9401 3.6955 3.6547 3.9185 3.9217 3.9164 3.9144 4.2196 4.2231 1.0168 1.0326 1.0149 1.0008 0.9998 1.0025 1.0011 1.0030 1.0073 1.0212 1.0098 1.0078 0.9965 0.9954 1.0078 0.9986 0.9983 1.0155 1.0046 1.0154 1.0048 1.0066 1.0096 1.0069 1.0097
dispcorr: -0.023294661 hartree
energy: -1094.900281282753
dipole: -16.45746 17.52922 1.07176 -18.11997 16.40109 -1.71888 -13.37101 11.78937 -1.58163
magnitude: 2.56998 au
magnitude: 6.53236 debye
