program: Orca
programVersion: 5.0.2
elementType: O O O O N C C C C C C C C C C C C C C C C C C C H H H H H H H H H H H H H H H H H H H H H H H H H
charge: 0
multiplicity: 1
keywords: wb97x-d3
keywords: def2-TZVPP
keywords: def2/J RIJCOSX
keywords: DEFGRID2
keywords: scfconv7
keywords: smallprint printgap noloewdin
keywords: NOSOSCF
formula: C19H25NO4
InChI: InChI=1/C19H25NO4/c1-11(2)9-14-15(19(14,3)4)18(23)24-10-20-16(21)12-7-5-6-8-13(12)17(20)22/h9,14-15H,5-8,10H2,1-4H3
49 atoms
O  -0.631727 0.437031 1.250369
O  -1.630454 2.44261 1.201859
O  2.430636 -1.27686 1.848284
O  1.361041 2.501962 -0.432442
N  1.659997 0.726737 1.004974
C  -2.400742 0.02989 -1.302494
C  -2.776743 -0.848925 -0.157549
C  -2.656848 0.646826 0.066673
C  -0.998134 -0.054881 -1.855943
C  -3.429247 0.3645 -2.355601
C  -4.103204 -1.507245 -0.042343
C  -1.603826 1.279974 0.879427
C  -4.620624 -1.963452 1.101364
C  0.545169 0.945406 1.864567
C  -5.950571 -2.651649 1.1389
C  -3.927205 -1.836644 2.423112
C  3.387021 -0.278943 -0.138767
C  3.07697 0.832266 -0.80867
C  4.460761 -1.230989 -0.513076
C  3.765221 1.310226 -2.032873
C  4.921211 -0.944237 -1.943567
C  5.083599 0.55302 -2.202423
C  2.477232 -0.397729 1.02748
C  1.945436 1.497684 -0.116436
H  -1.950412 -1.424469 0.248885
H  -3.590972 1.193695 0.133492
H  -0.656796 0.91651 -2.219249
H  -0.272271 -0.423973 -1.133862
H  -0.982118 -0.742908 -2.70384
H  -3.167106 1.295946 -2.861239
H  -3.474232 -0.419609 -3.11464
H  -4.430827 0.48817 -1.943864
H  -4.672046 -1.642954 -0.957742
H  0.699978 0.395814 2.790314
H  0.454037 2.004895 2.093238
H  -6.408438 -2.718553 0.151893
H  -5.858673 -3.666051 1.536719
H  -6.645824 -2.125308 1.798347
H  -3.65428 -2.821123 2.813114
H  -3.020632 -1.235048 2.379793
H  -4.59002 -1.386489 3.166239
H  5.293391 -1.128148 0.190535
H  4.109594 -2.260926 -0.413495
H  3.112759 1.153975 -2.898166
H  3.937179 2.387751 -1.977229
H  5.86262 -1.461363 -2.134532
H  4.19059 -1.355804 -2.645853
H  5.473321 0.718935 -3.207734
H  5.823898 0.961993 -1.508665
elementType: O N C H
totalener: -1094.87666178 hartree
nucrepener: 2131.19491856 hartree
electener: -3226.07158034 hartree
oneelecener: -5724.22569270 hartree
twoeener: 2498.15411236 hartree
cpcmener: -0.03277633 hartree
kineticenergy: 1090.04101507 hartree
xcener: -105.971117510016 hartree
chargesum: -0.0000000
charge: -0.274435 -0.450742 -0.408488 -0.400844 -0.081005 0.155055 0.000813 -0.116419 -0.269122 -0.300614 -0.305113 0.401471 -0.006832 0.060806 -0.228242 -0.247635 -0.078622 -0.023900 -0.068726 -0.072190 -0.137194 -0.135049 0.322440 0.248755 0.106228 0.092704 0.100708 0.077169 0.099258 0.100142 0.099219 0.091080 0.123217 0.125643 0.140103 0.088372 0.094022 0.094808 0.101496 0.079124 0.094189 0.100604 0.093200 0.101089 0.094624 0.080985 0.078540 0.081458 0.077849
qa: -0.2744 -0.4507 -0.4085 -0.4008 -0.0810 0.1551 0.0008 -0.1164 -0.2691 -0.3006 -0.3051 0.4015 -0.0068 0.0608 -0.2282 -0.2476 -0.0786 -0.0239 -0.0687 -0.0722 -0.1372 -0.1350 0.3224 0.2488 0.1062 0.0927 0.1007 0.0772 0.0993 0.1001 0.0992 0.0911 0.1232 0.1256 0.1401 0.0884 0.0940 0.0948 0.1015 0.0791 0.0942 0.1006 0.0932 0.1011 0.0946 0.0810 0.0785 0.0815 0.0778
va: 2.0821 2.0582 2.1095 2.1073 3.0873 3.7225 3.7827 3.8239 3.8833 3.9135 3.8796 4.1579 3.7064 3.8816 3.9302 3.9420 3.7012 3.6063 3.9179 3.9208 3.9166 3.9148 4.2008 4.2270 1.0198 1.0296 1.0049 1.0129 1.0031 1.0017 0.9989 1.0014 1.0037 1.0111 1.0203 1.0069 0.9956 0.9966 0.9980 1.0180 0.9996 1.0049 1.0160 1.0056 1.0155 1.0095 1.0067 1.0093 1.0068
dispcorr: -0.025056667 hartree
energy: -1094.901718442448
dipole: -13.45901 14.72681 1.26780 -13.21344 11.71156 -1.50188 -11.85477 10.58273 -1.27204
magnitude: 2.34116 au
magnitude: 5.95076 debye
