program: Orca
programVersion: 5.0.2
elementType: O O O O N C C C C C C C C C C C C C C C C C C C H H H H H H H H H H H H H H H H H H H H H H H H H
charge: 0
multiplicity: 1
keywords: wb97x-d3
keywords: def2-TZVPP
keywords: def2/J RIJCOSX
keywords: DEFGRID2
keywords: scfconv7
keywords: smallprint printgap noloewdin
keywords: NOSOSCF
formula: C19H25NO4
InChI: InChI=1/C19H25NO4/c1-11(2)9-14-15(19(14,3)4)18(23)24-10-20-16(21)12-7-5-6-8-13(12)17(20)22/h9,14-15H,5-8,10H2,1-4H3
49 atoms
O  -0.384989 0.83731 0.03349
O  -1.855144 2.246938 -0.872034
O  2.015396 -0.428592 -1.990093
O  2.355363 1.878409 1.90895
N  1.895836 0.965258 -0.157986
C  -3.865303 0.731154 1.032549
C  -4.001321 0.228584 -0.361501
C  -2.622321 0.285161 0.271981
C  -4.114371 2.192487 1.311344
C  -4.263106 -0.167275 2.179017
C  -4.62014 -1.084295 -0.679489
C  -1.62785 1.235152 -0.251028
C  -4.254037 -1.877484 -1.689489
C  0.684999 1.641404 -0.461637
C  -4.945879 -3.180362 -1.949024
C  -3.135297 -1.548982 -2.629786
C  3.63672 -0.541359 -0.195721
C  3.732642 0.131235 0.952385
C  4.579253 -1.591437 -0.652188
C  4.785449 -0.073759 1.97693
C  5.849259 -1.537778 0.199169
C  5.535291 -1.375417 1.686082
C  2.446395 -0.05104 -0.932222
C  2.615337 1.105592 1.024436
H  -4.164678 1.007658 -1.103063
H  -2.206347 -0.661044 0.599377
H  -3.916248 2.832569 0.454524
H  -5.160816 2.336614 1.588467
H  -3.504198 2.545654 2.145207
H  -3.742262 0.126466 3.092509
H  -5.33511 -0.092758 2.374017
H  -4.031398 -1.216165 1.992738
H  -5.447025 -1.399534 -0.048641
H  0.687119 2.620435 0.01726
H  0.603837 1.773142 -1.540533
H  -5.392772 -3.197559 -2.946626
H  -4.23742 -4.012579 -1.914893
H  -5.734364 -3.380314 -1.223435
H  -3.471638 -1.616898 -3.667648
H  -2.722424 -0.552659 -2.480576
H  -2.317705 -2.26805 -2.524922
H  4.096835 -2.570945 -0.570317
H  4.812134 -1.459174 -1.711484
H  5.470485 0.780298 1.965193
H  4.34519 -0.091119 2.976858
H  6.435652 -2.443373 0.037312
H  6.469006 -0.700153 -0.133836
H  6.458116 -1.402027 2.267384
H  4.929905 -2.222005 2.02275
elementType: O N C H
totalener: -1094.88034494 hartree
nucrepener: 2059.30088623 hartree
electener: -3154.18123117 hartree
oneelecener: -5580.66510787 hartree
twoeener: 2426.48387670 hartree
cpcmener: -0.02925885 hartree
kineticenergy: 1090.03941663 hartree
xcener: -105.968974209468 hartree
chargesum: -0.0000000
charge: -0.277258 -0.473529 -0.408541 -0.406872 -0.116360 0.148211 -0.015728 -0.091115 -0.276319 -0.285779 -0.292955 0.386070 -0.010198 0.090362 -0.227562 -0.242737 -0.070706 -0.071644 -0.073661 -0.070540 -0.135172 -0.137097 0.321967 0.316820 0.101870 0.092796 0.092255 0.094661 0.099275 0.098110 0.098593 0.092567 0.121496 0.132441 0.128607 0.095668 0.093658 0.089101 0.099194 0.082749 0.099839 0.101000 0.093573 0.100531 0.093783 0.080966 0.078197 0.081254 0.078161
qa: -0.2773 -0.4735 -0.4085 -0.4069 -0.1164 0.1482 -0.0157 -0.0911 -0.2763 -0.2858 -0.2930 0.3861 -0.0102 0.0904 -0.2276 -0.2427 -0.0707 -0.0716 -0.0737 -0.0705 -0.1352 -0.1371 0.3220 0.3168 0.1019 0.0928 0.0923 0.0947 0.0993 0.0981 0.0986 0.0926 0.1215 0.1324 0.1286 0.0957 0.0937 0.0891 0.0992 0.0827 0.0998 0.1010 0.0936 0.1005 0.0938 0.0810 0.0782 0.0813 0.0782
va: 2.1049 2.0288 2.1089 2.1114 3.1278 3.7067 3.8178 3.8244 3.8906 3.9114 3.8934 4.1286 3.7054 3.8872 3.9309 3.9382 3.6652 3.6755 3.9223 3.9195 3.9126 3.9165 4.2147 4.2189 1.0264 1.0291 1.0184 1.0009 0.9992 1.0030 0.9998 1.0017 1.0034 1.0033 1.0028 0.9965 0.9964 1.0062 1.0001 1.0137 0.9983 1.0051 1.0152 1.0047 1.0154 1.0096 1.0067 1.0093 1.0067
dispcorr: -0.022457562 hartree
energy: -1094.902802505216
dipole: -16.00539 17.38565 1.38026 -14.59339 12.90936 -1.68403 1.92299 -1.22709 0.69591
magnitude: 2.28591 au
magnitude: 5.81032 debye
