program: Orca
programVersion: 5.0.2
elementType: O O O O N C C C C C C C C C C C C C C C C C C C H H H H H H H H H H H H H H H H H H H H H H H H H
charge: 0
multiplicity: 1
keywords: wb97x-d3
keywords: def2-TZVPP
keywords: def2/J RIJCOSX
keywords: DEFGRID2
keywords: scfconv7
keywords: smallprint printgap noloewdin
keywords: NOSOSCF
formula: C19H25NO4
InChI: InChI=1/C19H25NO4/c1-11(2)9-14-15(19(14,3)4)18(23)24-10-20-16(21)12-7-5-6-8-13(12)17(20)22/h9,14-15H,5-8,10H2,1-4H3
49 atoms
O  -0.178563 0.471904 -0.480734
O  -1.712564 0.811395 -2.062371
O  2.492341 2.520198 0.13257
O  2.324647 -1.794948 -1.281362
N  2.095662 0.447952 -0.797272
C  -3.595177 1.156851 0.446108
C  -3.79297 -0.203051 -0.152704
C  -2.390454 0.271037 0.174161
C  -3.874352 2.367933 -0.40915
C  -3.926213 1.375125 1.90267
C  -4.370182 -1.332544 0.605578
C  -1.438242 0.549996 -0.91481
C  -5.444384 -2.031762 0.228349
C  0.855105 0.702366 -1.438095
C  -5.956678 -3.173005 1.052181
C  -6.203844 -1.73867 -1.038012
C  4.000927 0.657364 0.478639
C  3.958002 -0.605837 0.052693
C  5.066251 1.233492 1.334636
C  4.982193 -1.639614 0.339377
C  5.908597 0.103313 1.930007
C  6.240876 -0.9699 0.894217
C  2.809395 1.372383 -0.042429
C  2.726578 -0.790931 -0.753574
H  -4.03074 -0.186441 -1.211981
H  -1.937665 -0.157305 1.061934
H  -3.240379 3.209215 -0.120579
H  -3.731295 2.187313 -1.472083
H  -4.911924 2.678495 -0.269882
H  -3.659978 0.525539 2.530571
H  -3.395517 2.247655 2.288845
H  -4.995863 1.55664 2.028173
H  -3.875654 -1.603098 1.533926
H  0.829698 1.734575 -1.787357
H  0.749146 0.035068 -2.293092
H  -6.982773 -2.989144 1.382363
H  -5.98367 -4.097808 0.469007
H  -5.345051 -3.351364 1.936849
H  -5.646362 -2.051283 -1.924701
H  -7.15514 -2.270743 -1.059637
H  -6.423359 -0.676654 -1.155522
H  5.687108 1.907109 0.734994
H  4.628781 1.851136 2.122856
H  4.57738 -2.361727 1.056058
H  5.20921 -2.209685 -0.564744
H  6.827275 0.515385 2.350005
H  5.361893 -0.35258 2.760656
H  6.89276 -1.726035 1.334172
H  6.800005 -0.517097 0.070236
elementType: O N C H
totalener: -1094.88046677 hartree
nucrepener: 2025.03044086 hartree
electener: -3119.91090763 hartree
oneelecener: -5512.11729348 hartree
twoeener: 2392.20638585 hartree
cpcmener: -0.03033132 hartree
kineticenergy: 1090.03034278 hartree
xcener: -105.967355804805 hartree
chargesum: -0.0000000
charge: -0.274886 -0.471388 -0.407723 -0.407526 -0.112064 0.118462 0.046165 -0.118709 -0.282044 -0.262979 -0.299762 0.402570 -0.010249 0.088797 -0.220429 -0.284237 -0.072541 -0.075219 -0.071059 -0.071908 -0.133676 -0.136110 0.318206 0.321776 0.094839 0.087203 0.099169 0.093380 0.095064 0.086881 0.098390 0.096431 0.118110 0.134546 0.127191 0.094830 0.097922 0.084745 0.105737 0.094824 0.101728 0.099637 0.094281 0.101320 0.093675 0.080092 0.077438 0.081214 0.077882
qa: -0.2749 -0.4714 -0.4077 -0.4075 -0.1121 0.1185 0.0462 -0.1187 -0.2820 -0.2630 -0.2998 0.4026 -0.0102 0.0888 -0.2204 -0.2842 -0.0725 -0.0752 -0.0711 -0.0719 -0.1337 -0.1361 0.3182 0.3218 0.0948 0.0872 0.0992 0.0934 0.0951 0.0869 0.0984 0.0964 0.1181 0.1345 0.1272 0.0948 0.0979 0.0847 0.1057 0.0948 0.1017 0.0996 0.0943 0.1013 0.0937 0.0801 0.0774 0.0812 0.0779
va: 2.1150 2.0332 2.1105 2.1113 3.1248 3.6939 3.7480 3.9152 3.9044 3.9108 3.8878 4.1410 3.6945 3.8850 3.9221 3.9414 3.6735 3.6692 3.9214 3.9220 3.9157 3.9147 4.2177 4.2152 1.0267 1.0361 0.9995 1.0191 1.0006 1.0053 1.0024 1.0025 1.0089 1.0006 1.0046 0.9937 0.9928 1.0101 0.9957 1.0043 0.9964 1.0050 1.0151 1.0051 1.0151 1.0095 1.0070 1.0095 1.0068
dispcorr: -0.021619712 hartree
energy: -1094.902086485177
dipole: -22.14647 23.38172 1.23526 -5.68502 5.23782 -0.44720 11.15506 -9.64923 1.50583
magnitude: 1.99834 au
magnitude: 5.07939 debye
