program: Orca
programVersion: 5.0.2
elementType: O O O O N C C C C C C C C C C C C C C C C C C C H H H H H H H H H H H H H H H H H H H H H H H H H
charge: 0
multiplicity: 1
keywords: wb97x-d3
keywords: def2-TZVPP
keywords: def2/J RIJCOSX
keywords: DEFGRID2
keywords: scfconv7
keywords: smallprint printgap noloewdin
keywords: NOSOSCF
formula: C19H25NO4
InChI: InChI=1/C19H25NO4/c1-11(2)9-14-15(19(14,3)4)18(23)24-10-20-16(21)12-7-5-6-8-13(12)17(20)22/h9,14-15H,5-8,10H2,1-4H3
49 atoms
O  -0.231065 0.755642 0.10776
O  -1.766433 2.087088 -0.808596
O  2.246317 -0.15952 -2.072625
O  2.444184 1.702675 2.067435
N  2.041404 1.006924 -0.094333
C  -3.729633 0.437186 1.003891
C  -3.77971 -0.101125 -0.392106
C  -2.435727 0.06722 0.297134
C  -4.100761 1.882834 1.226312
C  -4.1201 -0.450336 2.161419
C  -4.253859 -1.461646 -0.710884
C  -1.489236 1.081471 -0.197796
C  -5.090484 -1.801551 -1.696982
C  0.795938 1.644345 -0.332455
C  -5.47732 -3.234178 -1.912574
C  -5.706903 -0.839687 -2.666639
C  3.873918 -0.372887 -0.293719
C  3.929548 0.169558 0.923555
C  4.877623 -1.305798 -0.860405
C  4.993902 -0.086834 1.924177
C  6.141633 -1.277164 0.000935
C  5.817705 -1.302326 1.494299
C  2.653583 0.121749 -0.975706
C  2.752328 1.056343 1.100193
H  -3.979769 0.654112 -1.144521
H  -1.967958 -0.842771 0.656554
H  -3.940919 2.508568 0.351417
H  -5.159887 1.949391 1.483856
H  -3.535535 2.31152 2.056661
H  -3.771215 -1.476436 2.051904
H  -3.705125 -0.063196 3.094091
H  -5.206307 -0.479278 2.270831
H  -3.87369 -2.259108 -0.078798
H  0.753662 2.581733 0.222166
H  0.698757 1.856888 -1.396673
H  -6.556504 -3.371477 -1.802986
H  -5.227694 -3.559527 -2.9264
H  -4.980402 -3.906936 -1.213451
H  -5.515489 0.206359 -2.435551
H  -5.342422 -1.027574 -3.680465
H  -6.791074 -0.974198 -2.701002
H  4.453394 -2.314468 -0.896921
H  5.103666 -1.037875 -1.895331
H  5.627945 0.801531 2.011399
H  4.556417 -0.241031 2.91355
H  6.779279 -2.123608 -0.257852
H  6.712783 -0.373282 -0.230142
H  6.739797 -1.34172 2.075923
H  5.261547 -2.214608 1.728494
elementType: O N C H
totalener: -1094.88187360 hartree
nucrepener: 2027.52525296 hartree
electener: -3122.40712656 hartree
oneelecener: -5517.12011988 hartree
twoeener: 2394.71299332 hartree
cpcmener: -0.03050844 hartree
kineticenergy: 1090.03565382 hartree
xcener: -105.969537781271 hartree
chargesum: -0.0000000
charge: -0.276185 -0.472663 -0.407666 -0.406993 -0.114300 0.103967 0.049038 -0.092327 -0.276073 -0.267564 -0.275879 0.399508 -0.043823 0.090015 -0.218347 -0.255487 -0.070678 -0.073541 -0.074268 -0.070980 -0.135916 -0.136366 0.321716 0.317479 0.090254 0.087158 0.092291 0.094675 0.098368 0.087608 0.097325 0.097030 0.116366 0.135964 0.125924 0.093370 0.092156 0.088031 0.090937 0.098864 0.093008 0.101545 0.093388 0.100563 0.093919 0.081189 0.078218 0.081214 0.077968
qa: -0.2762 -0.4727 -0.4077 -0.4070 -0.1143 0.1040 0.0490 -0.0923 -0.2761 -0.2676 -0.2759 0.3995 -0.0438 0.0900 -0.2183 -0.2555 -0.0707 -0.0735 -0.0743 -0.0710 -0.1359 -0.1364 0.3217 0.3175 0.0903 0.0872 0.0923 0.0947 0.0984 0.0876 0.0973 0.0970 0.1164 0.1360 0.1259 0.0934 0.0922 0.0880 0.0909 0.0989 0.0930 0.1015 0.0934 0.1006 0.0939 0.0812 0.0782 0.0812 0.0780
va: 2.1144 2.0320 2.1108 2.1108 3.1278 3.6922 3.7646 3.8697 3.9038 3.9126 3.8828 4.1413 3.7580 3.8843 3.9221 3.9425 3.6643 3.6748 3.9223 3.9195 3.9133 3.9157 4.2161 4.2190 1.0327 1.0346 1.0197 1.0000 0.9994 1.0063 1.0019 1.0020 1.0114 1.0009 1.0053 0.9965 0.9959 1.0090 1.0095 0.9959 0.9977 1.0050 1.0153 1.0046 1.0154 1.0096 1.0066 1.0093 1.0069
dispcorr: -0.021419851 hartree
energy: -1094.903293455510
dipole: -21.14728 22.38757 1.24028 -13.76127 12.27738 -1.48388 1.02796 -0.37797 0.64999
magnitude: 2.04027 au
magnitude: 5.18596 debye
