program: Orca
programVersion: 5.0.2
elementType: O O O O N C C C C C C C C C C C C C C C C C C C H H H H H H H H H H H H H H H H H H H H H H H H H
charge: 0
multiplicity: 1
keywords: wb97x-d3
keywords: def2-TZVPP
keywords: def2/J RIJCOSX
keywords: DEFGRID2
keywords: scfconv7
keywords: smallprint printgap noloewdin
keywords: NOSOSCF
formula: C19H25NO4
InChI: InChI=1/C19H25NO4/c1-11(2)9-14-15(19(14,3)4)18(23)24-10-20-16(21)12-7-5-6-8-13(12)17(20)22/h9,14-15H,5-8,10H2,1-4H3
49 atoms
O  -0.26502 1.191842 0.705149
O  -1.440397 2.05588 -0.997153
O  1.703251 0.201321 -1.662216
O  2.918609 1.598891 2.485365
N  2.02848 1.17099 0.399188
C  -3.794611 0.627222 0.542472
C  -3.417914 -0.15722 -0.675834
C  -2.338543 0.253934 0.296265
C  -4.26791 2.048902 0.368697
C  -4.463268 -0.087129 1.690871
C  -3.746698 -1.596545 -0.830588
C  -1.336942 1.260208 -0.096352
C  -4.788608 -2.068629 -1.520477
C  0.870688 1.999827 0.422097
C  -5.035239 -3.540734 -1.650314
C  -5.787501 -1.192816 -2.212192
C  3.589787 -0.388633 -0.259585
C  3.946554 0.028145 0.95609
C  4.33755 -1.375004 -1.077045
C  5.145038 -0.43102 1.699423
C  5.74369 -1.548067 -0.500003
C  5.725035 -1.675068 1.022917
C  2.344058 0.315956 -0.649298
C  2.948705 1.021624 1.429437
H  -3.43437 0.423771 -1.59373
H  -1.958404 -0.525332 0.948267
H  -3.880669 2.523535 -0.530583
H  -5.357759 2.062097 0.297875
H  -3.989917 2.667703 1.224693
H  -4.339683 0.475497 2.618411
H  -5.535106 -0.187723 1.506084
H  -4.06296 -1.087395 1.854909
H  -3.082465 -2.307748 -0.347635
H  0.980765 2.739709 1.213081
H  0.764601 2.515031 -0.530614
H  -6.011887 -3.813461 -1.241447
H  -5.045125 -3.846157 -2.700186
H  -4.278027 -4.133162 -1.136475
H  -6.79713 -1.403761 -1.849492
H  -5.603007 -0.129041 -2.069776
H  -5.801184 -1.389938 -3.28762
H  3.798171 -2.327799 -1.07766
H  4.379194 -1.052891 -2.120213
H  5.882904 0.377695 1.722671
H  4.892276 -0.635833 2.74255
H  6.214565 -2.427388 -0.9419
H  6.356887 -0.688446 -0.785592
H  6.735214 -1.853115 1.394578
H  5.130688 -2.548679 1.30564
elementType: O N C H
totalener: -1094.87919175 hartree
nucrepener: 2045.81747095 hartree
electener: -3140.69666269 hartree
oneelecener: -5553.92766787 hartree
twoeener: 2413.23100518 hartree
cpcmener: -0.03101593 hartree
kineticenergy: 1090.03731443 hartree
xcener: -105.969581815207 hartree
chargesum: -0.0000000
charge: -0.282036 -0.459335 -0.409806 -0.409623 -0.097043 0.140985 -0.011105 -0.138199 -0.295966 -0.265620 -0.253321 0.420920 -0.037114 0.078934 -0.229067 -0.249565 -0.058142 -0.085724 -0.074110 -0.069676 -0.134148 -0.136526 0.317068 0.320958 0.098352 0.093431 0.095087 0.095343 0.101190 0.099064 0.095782 0.090991 0.120191 0.125318 0.139333 0.093628 0.094162 0.089121 0.095237 0.087040 0.099499 0.100996 0.092397 0.100339 0.093742 0.080543 0.077745 0.080882 0.077848
qa: -0.2820 -0.4593 -0.4098 -0.4096 -0.0970 0.1410 -0.0111 -0.1382 -0.2960 -0.2656 -0.2533 0.4209 -0.0371 0.0789 -0.2291 -0.2496 -0.0581 -0.0857 -0.0741 -0.0697 -0.1341 -0.1365 0.3171 0.3210 0.0984 0.0934 0.0951 0.0953 0.1012 0.0991 0.0958 0.0910 0.1202 0.1253 0.1393 0.0936 0.0942 0.0891 0.0952 0.0870 0.0995 0.1010 0.0924 0.1003 0.0937 0.0805 0.0777 0.0809 0.0778
va: 2.1067 2.0544 2.1079 2.1088 3.0988 3.6766 3.7872 3.8698 3.9033 3.9060 3.8668 4.1788 3.7063 3.8511 3.9284 3.9411 3.6560 3.6975 3.9230 3.9194 3.9132 3.9174 4.2224 4.2274 1.0249 1.0370 1.0173 1.0007 0.9996 1.0029 1.0022 1.0028 1.0075 1.0122 1.0183 0.9962 0.9954 1.0077 0.9978 1.0083 0.9985 1.0048 1.0158 1.0048 1.0154 1.0097 1.0069 1.0095 1.0065
dispcorr: -0.022365863 hartree
energy: -1094.901557609690
dipole: -22.42206 23.34412 0.92206 -15.63223 14.12835 -1.50388 -3.03328 3.57287 0.53959
magnitude: 1.84473 au
magnitude: 4.68892 debye
