program: Orca
programVersion: 5.0.2
elementType: O O O O N C C C C C C C C C C C C C C C C C C C H H H H H H H H H H H H H H H H H H H H H H H H H
charge: 0
multiplicity: 1
keywords: wb97x-d3
keywords: def2-TZVPP
keywords: def2/J RIJCOSX
keywords: DEFGRID2
keywords: scfconv7
keywords: smallprint printgap noloewdin
keywords: NOSOSCF
formula: C19H25NO4
InChI: InChI=1/C19H25NO4/c1-11(2)9-14-15(19(14,3)4)18(23)24-10-20-16(21)12-7-5-6-8-13(12)17(20)22/h9,14-15H,5-8,10H2,1-4H3
49 atoms
O  -0.244299 1.122969 -0.175828
O  -1.70973 1.543729 1.46332
O  2.866481 2.30668 -1.558156
O  1.718052 -0.355567 1.937825
N  2.007475 1.231786 0.294168
C  -2.68207 -1.316806 0.512971
C  -3.679803 -0.255579 0.15099
C  -2.225658 -0.069879 -0.228441
C  -2.3261 -1.506091 1.967432
C  -2.635046 -2.606982 -0.269559
C  -4.688669 -0.446745 -0.908762
C  -1.407876 0.945543 0.459656
C  -5.958976 -0.029034 -0.887882
C  0.76742 1.912648 0.442467
C  -6.87901 -0.324873 -2.034607
C  -6.596203 0.727989 0.238485
C  3.988398 0.415281 -0.54684
C  3.650705 -0.371963 0.475667
C  5.220102 0.274854 -1.361036
C  4.436778 -1.535482 0.953595
C  6.197386 -0.659045 -0.645139
C  5.496652 -1.8977 -0.088582
C  2.932992 1.444588 -0.720959
C  2.362661 0.109099 1.032943
H  -3.99399 0.352712 0.992241
H  -1.963963 -0.230977 -1.268797
H  -2.942757 -2.299526 2.394605
H  -1.281648 -1.806585 2.079607
H  -2.48539 -0.614623 2.570352
H  -1.672383 -3.101845 -0.125779
H  -3.411614 -3.292998 0.07553
H  -2.769394 -2.465754 -1.341207
H  -4.356663 -0.98814 -1.789903
H  0.557385 2.070325 1.498662
H  0.827178 2.879484 -0.054885
H  -7.762969 -0.873044 -1.696777
H  -7.24662 0.597538 -2.492545
H  -6.395814 -0.916458 -2.812326
H  -5.885156 1.123434 0.961927
H  -7.177444 1.570104 -0.145046
H  -7.299843 0.091606 0.783178
H  4.957646 -0.120053 -2.347963
H  5.672547 1.253199 -1.54003
H  4.903383 -1.286801 1.912308
H  3.777508 -2.383881 1.152475
H  6.991345 -0.953926 -1.332638
H  6.678327 -0.116345 0.173878
H  6.22795 -2.575315 0.354233
H  5.022053 -2.44349 -0.909296
elementType: O N C H
totalener: -1094.87996890 hartree
nucrepener: 2054.39587392 hartree
electener: -3149.27584282 hartree
oneelecener: -5570.97454557 hartree
twoeener: 2421.69870276 hartree
cpcmener: -0.03049583 hartree
kineticenergy: 1090.03465908 hartree
xcener: -105.969806666462 hartree
chargesum: -0.0000000
charge: -0.276924 -0.457180 -0.408345 -0.414595 -0.100832 0.101661 0.032221 -0.077794 -0.271722 -0.275940 -0.279823 0.382220 -0.042402 0.083690 -0.217254 -0.258281 -0.084047 -0.050761 -0.074673 -0.071367 -0.133726 -0.136711 0.325494 0.311166 0.093053 0.091462 0.097660 0.094831 0.092081 0.096908 0.098446 0.089223 0.115926 0.135005 0.127336 0.092298 0.093199 0.086754 0.091793 0.091977 0.100818 0.101694 0.093546 0.100884 0.093979 0.080767 0.077267 0.081090 0.077928
qa: -0.2769 -0.4572 -0.4083 -0.4146 -0.1008 0.1017 0.0322 -0.0778 -0.2717 -0.2759 -0.2798 0.3822 -0.0424 0.0837 -0.2173 -0.2583 -0.0840 -0.0508 -0.0747 -0.0714 -0.1337 -0.1367 0.3255 0.3112 0.0931 0.0915 0.0977 0.0948 0.0921 0.0969 0.0984 0.0892 0.1159 0.1350 0.1273 0.0923 0.0932 0.0868 0.0918 0.0920 0.1008 0.1017 0.0935 0.1009 0.0940 0.0808 0.0773 0.0811 0.0779
va: 2.1077 2.0526 2.1092 2.0949 3.1020 3.7037 3.7903 3.8118 3.9037 3.9126 3.8879 4.1934 3.7600 3.8616 3.9222 3.9389 3.6982 3.6605 3.9203 3.9193 3.9136 3.9157 4.2217 4.2110 1.0280 1.0328 1.0004 1.0047 1.0181 1.0016 1.0012 1.0068 1.0115 1.0171 1.0096 0.9951 0.9966 1.0093 1.0102 0.9979 0.9952 1.0051 1.0158 1.0049 1.0153 1.0096 1.0071 1.0092 1.0068
dispcorr: -0.022209052 hartree
energy: -1094.902177949308
dipole: -19.72601 21.10372 1.37772 -16.29515 14.84673 -1.44842 -3.43695 2.67463 -0.76233
magnitude: 2.13943 au
magnitude: 5.43800 debye
