program: Orca
programVersion: 5.0.2
elementType: O O O O N C C C C C C C C C C C C C C C C C C C H H H H H H H H H H H H H H H H H H H H H H H H H
charge: 0
multiplicity: 1
keywords: wb97x-d3
keywords: def2-TZVPP
keywords: def2/J RIJCOSX
keywords: DEFGRID2
keywords: scfconv7
keywords: smallprint printgap noloewdin
keywords: NOSOSCF
formula: C19H25NO4
InChI: InChI=1/C19H25NO4/c1-11(2)9-14-15(19(14,3)4)18(23)24-10-20-16(21)12-7-5-6-8-13(12)17(20)22/h9,14-15H,5-8,10H2,1-4H3
49 atoms
O  -0.431298 1.412192 0.598695
O  -1.551831 2.52555 -0.994111
O  1.448979 0.208234 -1.821408
O  2.668461 1.372154 2.40456
N  1.833308 1.118691 0.26442
C  -4.064626 1.164672 0.276881
C  -3.605488 0.340781 -0.877131
C  -2.60844 0.737462 0.195224
C  -4.464694 2.60032 0.040675
C  -4.862322 0.498544 1.373355
C  -4.003053 -1.081928 -1.036664
C  -1.5175 1.66644 -0.154963
C  -3.195161 -2.084497 -1.385207
C  0.780099 2.077064 0.282183
C  -3.712758 -3.48546 -1.518392
C  -1.733806 -1.918972 -1.671036
C  3.137171 -0.682322 -0.331189
C  3.49374 -0.339271 0.906253
C  3.73255 -1.794587 -1.113447
C  4.562509 -0.99611 1.699773
C  4.550702 -2.692202 -0.182774
C  5.412273 -1.876816 0.781611
C  2.046183 0.223496 -0.78101
C  2.653395 0.807101 1.347037
H  -3.487477 0.898014 -1.803986
H  -2.321667 -0.046205 0.886637
H  -3.916857 3.064064 -0.774918
H  -5.527872 2.64624 -0.201998
H  -4.306962 3.202667 0.937054
H  -4.5571 -0.534165 1.542304
H  -4.745783 1.039128 2.314059
H  -5.926224 0.493597 1.126689
H  -5.054157 -1.30447 -0.87325
H  0.99812 2.814074 1.054246
H  0.711336 2.570636 -0.685944
H  -3.567649 -3.8631 -2.533395
H  -3.173448 -4.16555 -0.854155
H  -4.773591 -3.557302 -1.28169
H  -1.400589 -0.884889 -1.658021
H  -1.131299 -2.476507 -0.948689
H  -1.490197 -2.327251 -2.654572
H  2.94952 -2.360889 -1.622715
H  4.362701 -1.382119 -1.908141
H  5.175001 -0.246026 2.205102
H  4.107231 -1.591413 2.497885
H  3.870926 -3.328736 0.391031
H  5.177896 -3.362022 -0.77271
H  6.095296 -1.243579 0.207799
H  6.036485 -2.541082 1.3810
totalener: -1094.85451709 hartree
nucrepener: 2103.82614820 hartree
electener: -3198.68066530 hartree
oneelecener: -5669.52864836 hartree
twoeener: 2470.84798306 hartree
kineticenergy: 1090.09305062 hartree
xcener: -105.971043006081 hartree
chargesum: -0.0000000
charge: -0.269682 -0.382604 -0.323308 -0.318680 -0.112345 0.128951 -0.010782 -0.134000 -0.260946 -0.266851 -0.244081 0.348438 -0.001171 0.073869 -0.213252 -0.222249 -0.067689 -0.101733 -0.074443 -0.075057 -0.133947 -0.134550 0.250940 0.269431 0.107295 0.091198 0.103522 0.081813 0.084139 0.085079 0.092139 0.088739 0.092328 0.113456 0.138189 0.088109 0.082693 0.078378 0.096565 0.078056 0.090066 0.093257 0.093408 0.094145 0.093876 0.075077 0.079431 0.075323 0.079459
qa: -0.2697 -0.3826 -0.3233 -0.3187 -0.1123 0.1290 -0.0108 -0.1340 -0.2609 -0.2669 -0.2441 0.3484 -0.0012 0.0739 -0.2133 -0.2222 -0.0677 -0.1017 -0.0744 -0.0751 -0.1339 -0.1345 0.2509 0.2694 0.1073 0.0912 0.1035 0.0818 0.0841 0.0851 0.0921 0.0887 0.0923 0.1135 0.1382 0.0881 0.0827 0.0784 0.0966 0.0781 0.0901 0.0933 0.0934 0.0941 0.0939 0.0751 0.0794 0.0753 0.0795
va: 2.1004 2.1194 2.1802 2.1952 3.0989 3.7309 3.8136 3.8490 3.9058 3.9074 3.8982 4.1692 3.7379 3.8832 3.9412 3.9418 3.6162 3.6543 3.9266 3.9241 3.8976 3.8972 4.2618 4.2789 1.0244 1.0300 1.0220 1.0017 1.0020 1.0056 1.0062 1.0021 1.0104 1.0086 1.0145 0.9988 0.9992 1.0100 1.0146 1.0008 1.0035 1.0189 1.0082 1.0194 1.0085 1.0089 1.0120 1.0088 1.0121
dispcorr: -0.023716706 hartree
energy: -1094.878233799978
dipole: -15.08301 15.94992 0.86691 -17.48389 16.02971 -1.45419 -2.13305 2.41767 0.28462
magnitude: 1.71674 au
magnitude: 4.36361 debye
