program: Orca
programVersion: 5.0.2
elementType: O O O O N C C C C C C C C C C C C C C C C C C C H H H H H H H H H H H H H H H H H H H H H H H H H
charge: 0
multiplicity: 1
keywords: wb97x-d3
keywords: def2-TZVPP
keywords: def2/J RIJCOSX
keywords: DEFGRID2
keywords: scfconv7
keywords: smallprint printgap noloewdin
keywords: NOSOSCF
formula: C19H25NO4
InChI: InChI=1/C19H25NO4/c1-11(2)9-14-15(19(14,3)4)18(23)24-10-20-16(21)12-7-5-6-8-13(12)17(20)22/h9,14-15H,5-8,10H2,1-4H3
49 atoms
O  -0.532217 1.19735 0.900162
O  -1.8153 2.723563 1.89997
O  1.822206 1.892688 -1.334796
O  2.15417 -0.129818 2.726219
N  1.75229 1.162367 0.853281
C  -3.137562 0.88736 -0.814043
C  -2.752221 -0.336358 -0.031464
C  -2.869212 0.985364 0.677653
C  -2.162532 1.46446 -1.811784
C  -4.577454 1.047154 -1.235971
C  -3.721777 -1.421633 0.266349
C  -1.714781 1.732608 1.227728
C  -3.919872 -2.493917 -0.501677
C  0.630525 1.907187 1.305972
C  -4.891181 -3.56751 -0.115547
C  -3.195484 -2.722711 -1.79342
C  3.240169 0.096578 -0.543618
C  3.336402 -0.495168 0.646849
C  4.028673 -0.272101 -1.746365
C  4.263416 -1.606525 0.975572
C  4.69639 -1.630591 -1.522345
C  5.314514 -1.740685 -0.128184
C  2.208052 1.164551 -0.462968
C  2.369793 0.144195 1.579708
H  -1.73297 -0.671628 -0.196611
H  -3.757833 1.139668 1.281124
H  -1.120173 1.291489 -1.554449
H  -2.334201 1.019339 -2.79391
H  -2.30439 2.542012 -1.915074
H  -4.763672 0.506107 -2.166008
H  -5.276552 0.663943 -0.493923
H  -4.812708 2.098743 -1.408253
H  -4.29415 -1.332874 1.185249
H  0.674431 1.996901 2.391078
H  0.646452 2.902262 0.860983
H  -4.387066 -4.531036 -0.005698
H  -5.395312 -3.346387 0.824303
H  -5.655763 -3.702981 -0.884576
H  -2.534314 -1.90094 -2.061938
H  -2.597025 -3.636264 -1.747976
H  -3.904353 -2.859023 -2.613818
H  3.386919 -0.288555 -2.630056
H  4.778301 0.501844 -1.940476
H  4.731112 -1.436402 1.947809
H  3.691168 -2.533816 1.082629
H  3.952212 -2.421997 -1.650645
H  5.458926 -1.797461 -2.284463
H  6.067642 -0.95716 -0.004331
H  5.838813 -2.6918 -0.024589
totalener: -1094.85318315 hartree
nucrepener: 2099.17456056 hartree
electener: -3194.02774371 hartree
oneelecener: -5659.87682124 hartree
twoeener: 2465.84907753 hartree
kineticenergy: 1090.09414485 hartree
xcener: -105.969417995408 hartree
chargesum: 0.0000000
charge: -0.267094 -0.357805 -0.321724 -0.312929 -0.123128 0.100338 0.014300 -0.108142 -0.265839 -0.243661 -0.215102 0.323982 -0.021813 0.077064 -0.212488 -0.238114 -0.072347 -0.090288 -0.076484 -0.074077 -0.134740 -0.135304 0.247160 0.260435 0.097244 0.081514 0.088338 0.081512 0.096995 0.084351 0.080478 0.096387 0.090919 0.126792 0.127761 0.085332 0.080203 0.083847 0.079003 0.093024 0.085776 0.094310 0.093146 0.094885 0.094123 0.075525 0.080163 0.075938 0.080235
qa: -0.2671 -0.3578 -0.3217 -0.3129 -0.1231 0.1003 0.0143 -0.1081 -0.2658 -0.2437 -0.2151 0.3240 -0.0218 0.0771 -0.2125 -0.2381 -0.0723 -0.0903 -0.0765 -0.0741 -0.1347 -0.1353 0.2472 0.2604 0.0972 0.0815 0.0883 0.0815 0.0970 0.0844 0.0805 0.0964 0.0909 0.1268 0.1278 0.0853 0.0802 0.0838 0.0790 0.0930 0.0858 0.0943 0.0931 0.0949 0.0941 0.0755 0.0802 0.0759 0.0802
va: 2.0857 2.1464 2.1862 2.2008 3.1182 3.7047 3.7728 3.9227 3.9171 3.9096 3.8686 4.2689 3.7341 3.9079 3.9421 3.9431 3.6243 3.6318 3.9256 3.9244 3.8973 3.8969 4.2676 4.2724 1.0199 1.0323 1.0157 1.0033 1.0041 1.0037 1.0078 1.0048 1.0149 1.0060 1.0005 0.9975 1.0109 0.9987 1.0111 1.0007 1.0008 1.0190 1.0079 1.0191 1.0086 1.0088 1.0117 1.0087 1.0120
dispcorr: -0.023751754 hartree
energy: -1094.876934906089
dipole: -14.68286 15.66405 0.98118 -18.52564 17.03569 -1.48994 -16.67028 15.48949 -1.18079
magnitude: 2.13937 au
magnitude: 5.43786 debye
