program: Orca
programVersion: 5.0.2
elementType: O O O O N C C C C C C C C C C C C C C C C C C C H H H H H H H H H H H H H H H H H H H H H H H H H
charge: 0
multiplicity: 1
keywords: wb97x-d3
keywords: def2-TZVPP
keywords: def2/J RIJCOSX
keywords: DEFGRID2
keywords: scfconv7
keywords: smallprint printgap noloewdin
keywords: NOSOSCF
formula: C19H25NO4
InChI: InChI=1/C19H25NO4/c1-11(2)9-14-15(19(14,3)4)18(23)24-10-20-16(21)12-7-5-6-8-13(12)17(20)22/h9,14-15H,5-8,10H2,1-4H3
49 atoms
O  -0.223698 0.72609 0.01136
O  -1.751052 2.053327 -0.929094
O  2.272741 -0.289343 -2.13818
O  2.451985 1.763999 1.919393
N  2.047976 0.958924 -0.207761
C  -3.730755 0.49476 0.934066
C  -3.778592 -0.098021 -0.440999
C  -2.439709 0.084047 0.250961
C  -4.090872 1.95162 1.096036
C  -4.140566 -0.341539 2.123588
C  -4.279941 -1.457571 -0.709885
C  -1.481396 1.068564 -0.291637
C  -5.065143 -1.839524 -1.719931
C  0.801364 1.582936 -0.477026
C  -5.496527 -3.269958 -1.854063
C  -5.587636 -0.931826 -2.791693
C  3.857487 -0.458829 -0.318536
C  3.908233 0.138762 0.871594
C  4.851339 -1.436213 -0.82766
C  4.95646 -0.090611 1.897456
C  6.105309 -1.391786 0.048136
C  5.759535 -1.342548 1.536933
C  2.65553 0.026415 -1.047118
C  2.746148 1.060519 0.994352
H  -3.954447 0.632624 -1.222641
H  -1.977309 -0.813769 0.645761
H  -3.57042 2.389122 1.950303
H  -3.85446 2.548492 0.219344
H  -5.162556 2.041002 1.283241
H  -3.811449 -1.37731 2.053966
H  -3.718136 0.072612 3.040509
H  -5.226707 -0.347749 2.229876
H  -3.97134 -2.225206 -0.00649
H  0.764545 2.548675 0.02743
H  0.70011 1.734377 -1.551504
H  -6.585818 -3.356066 -1.827135
H  -5.174811 -3.689737 -2.81056
H  -5.092193 -3.897908 -1.061017
H  -5.263568 -1.275387 -3.777051
H  -6.680343 -0.941998 -2.803775
H  -5.271322 0.102859 -2.684373
H  4.408847 -2.437636 -0.824451
H  5.09138 -1.223772 -1.87187
H  5.608384 0.787312 1.951513
H  4.504103 -0.183294 2.887292
H  6.734847 -2.257364 -0.162983
H  6.69464 -0.508357 -0.214405
H  6.67136 -1.380694 2.134652
H  5.178129 -2.23051 1.801639
totalener: -1094.85722972 hartree
nucrepener: 2028.37264662 hartree
electener: -3123.22987634 hartree
oneelecener: -5518.51867910 hartree
twoeener: 2395.28880276 hartree
kineticenergy: 1090.09207008 hartree
xcener: -105.971216272346 hartree
chargesum: -0.0000000
charge: -0.262996 -0.392063 -0.315627 -0.316584 -0.128012 0.085124 0.044141 -0.083441 -0.255356 -0.248725 -0.181707 0.341935 -0.052853 0.094150 -0.202109 -0.236564 -0.090175 -0.088946 -0.075393 -0.073945 -0.135232 -0.136606 0.264948 0.261068 0.088961 0.067874 0.085500 0.100674 0.084424 0.070914 0.091725 0.092963 0.069743 0.124038 0.121851 0.083269 0.084598 0.075692 0.086849 0.084530 0.084343 0.093504 0.093994 0.092668 0.094701 0.080405 0.075588 0.080562 0.075595
qa: -0.2630 -0.3921 -0.3156 -0.3166 -0.1280 0.0851 0.0441 -0.0834 -0.2554 -0.2487 -0.1817 0.3419 -0.0529 0.0942 -0.2021 -0.2366 -0.0902 -0.0889 -0.0754 -0.0739 -0.1352 -0.1366 0.2649 0.2611 0.0890 0.0679 0.0855 0.1007 0.0844 0.0709 0.0917 0.0930 0.0697 0.1240 0.1219 0.0833 0.0846 0.0757 0.0868 0.0845 0.0843 0.0935 0.0940 0.0927 0.0947 0.0804 0.0756 0.0806 0.0756
va: 2.1184 2.1081 2.1995 2.1983 3.1181 3.7338 3.7873 3.8907 3.9121 3.9190 3.9066 4.2102 3.8299 3.8988 3.9339 3.9450 3.6211 3.6287 3.9272 3.9256 3.8964 3.8992 4.2756 4.2781 1.0336 1.0371 1.0027 1.0224 1.0004 1.0108 1.0043 1.0036 1.0219 1.0021 1.0051 0.9981 0.9984 1.0124 0.9990 0.9990 1.0161 1.0084 1.0191 1.0080 1.0188 1.0118 1.0085 1.0114 1.0088
dispcorr: -0.021378425 hartree
energy: -1094.878608140701
dipole: -21.21008 22.10859 0.89850 -13.63768 12.52255 -1.11513 1.58361 -1.08046 0.50315
magnitude: 1.51789 au
magnitude: 3.85817 debye
