program: Orca
programVersion: 5.0.2
elementType: O O O O N C C C C C C C C C C C C C C C C C C C H H H H H H H H H H H H H H H H H H H H H H H H H
charge: 0
multiplicity: 1
keywords: wb97x-d3
keywords: def2-TZVPP
keywords: def2/J RIJCOSX
keywords: DEFGRID2
keywords: scfconv7
keywords: smallprint printgap noloewdin
keywords: NOSOSCF
formula: C19H25NO4
InChI: InChI=1/C19H25NO4/c1-11(2)9-14-15(19(14,3)4)18(23)24-10-20-16(21)12-7-5-6-8-13(12)17(20)22/h9,14-15H,5-8,10H2,1-4H3
49 atoms
O  -0.252946 1.192695 -0.282575
O  -1.821941 1.566815 -1.830483
O  2.85538 2.549959 0.584838
O  1.625284 -1.149707 -1.759002
N  1.96733 0.914218 -0.782728
C  -3.828637 1.194164 0.53438
C  -3.652522 -0.125889 -0.148503
C  -2.428965 0.661612 0.303049
C  -4.362145 2.350116 -0.277988
C  -4.279941 1.244417 1.975503
C  -3.946968 -1.421625 0.486468
C  -1.516403 1.193403 -0.728512
C  -4.31166 -2.551348 -0.125334
C  0.770485 1.555461 -1.200424
C  -4.567245 -3.800502 0.665158
C  -4.494134 -2.707587 -1.60426
C  3.833287 0.341115 0.436463
C  3.473811 -0.742845 -0.250777
C  5.006874 0.426849 1.341155
C  4.172071 -2.051576 -0.209281
C  5.92111 -0.778204 1.108972
C  5.12926 -2.080424 0.98376
C  2.870041 1.43594 0.142188
C  2.254501 -0.425055 -1.04074
H  -3.809963 -0.079801 -1.220111
H  -1.927721 0.286135 1.187906
H  -4.085335 2.295766 -1.32704
H  -5.451937 2.362699 -0.217584
H  -3.999757 3.302109 0.114749
H  -5.364864 1.145654 2.040517
H  -3.839844 0.461896 2.592192
H  -4.004701 2.200978 2.422703
H  -3.837024 -1.458242 1.566069
H  0.920981 2.634899 -1.187166
H  0.517967 1.237778 -2.211152
H  -5.589527 -4.158168 0.516662
H  -3.905696 -4.60928 0.344372
H  -4.418225 -3.650083 1.73388
H  -5.511072 -3.035281 -1.83426
H  -4.304411 -1.799194 -2.170483
H  -3.82474 -3.479249 -1.992089
H  5.54276 1.365039 1.181149
H  4.660396 0.45841 2.379237
H  3.446351 -2.866186 -0.15553
H  4.716134 -2.20216 -1.147434
H  6.498953 -0.619022 0.193893
H  6.644545 -0.854565 1.921945
H  4.554564 -2.243166 1.900118
H  5.810627 -2.927309 0.891059
totalener: -1094.85590509 hartree
nucrepener: 2049.52494713 hartree
electener: -3144.38085222 hartree
oneelecener: -5560.87480490 hartree
twoeener: 2416.49395268 hartree
kineticenergy: 1090.09788765 hartree
xcener: -105.972254761975 hartree
chargesum: -0.0000000
charge: -0.266990 -0.393277 -0.317735 -0.315348 -0.126698 0.089359 0.027691 -0.078040 -0.253430 -0.257337 -0.180609 0.352234 -0.048461 0.091182 -0.204878 -0.237004 -0.098196 -0.076742 -0.074463 -0.074878 -0.134555 -0.134654 0.266685 0.254958 0.090985 0.069861 0.102355 0.083890 0.083116 0.094081 0.073363 0.091484 0.070444 0.120284 0.125927 0.083927 0.084616 0.074929 0.084463 0.085418 0.087369 0.093783 0.093406 0.094914 0.092141 0.075125 0.080062 0.075413 0.079835
qa: -0.2670 -0.3933 -0.3177 -0.3153 -0.1267 0.0894 0.0277 -0.0780 -0.2534 -0.2573 -0.1806 0.3522 -0.0485 0.0912 -0.2049 -0.2370 -0.0982 -0.0767 -0.0745 -0.0749 -0.1346 -0.1347 0.2667 0.2550 0.0910 0.0699 0.1024 0.0839 0.0831 0.0941 0.0734 0.0915 0.0704 0.1203 0.1259 0.0839 0.0846 0.0749 0.0845 0.0854 0.0874 0.0938 0.0934 0.0949 0.0921 0.0751 0.0801 0.0754 0.0798
va: 2.1133 2.1070 2.1960 2.1964 3.1155 3.7422 3.8097 3.8604 3.9079 3.9190 3.9188 4.2023 3.8312 3.8953 3.9342 3.9442 3.6441 3.6137 3.9274 3.9250 3.8969 3.8985 4.2781 4.2813 1.0286 1.0361 1.0231 1.0001 1.0031 1.0029 1.0102 1.0041 1.0214 1.0035 1.0099 0.9981 0.9983 1.0122 0.9982 1.0170 0.9993 1.0190 1.0085 1.0192 1.0080 1.0087 1.0117 1.0089 1.0118
dispcorr: -0.021511810 hartree
energy: -1094.877416904903
dipole: -19.08715 19.98663 0.89948 -14.27645 13.30569 -0.97076 8.93941 -8.00426 0.93515
magnitude: 1.62048 au
magnitude: 4.11892 debye
