program: Orca
programVersion: 5.0.2
elementType: O O O O N C C C C C C C C C C C C C C C C C C C H H H H H H H H H H H H H H H H H H H H H H H H H
charge: 0
multiplicity: 1
keywords: wb97x-d3
keywords: def2-TZVPP
keywords: def2/J RIJCOSX
keywords: DEFGRID2
keywords: scfconv7
keywords: smallprint printgap noloewdin
keywords: NOSOSCF
formula: C19H25NO4
InChI: InChI=1/C19H25NO4/c1-11(2)9-14-15(19(14,3)4)18(23)24-10-20-16(21)12-7-5-6-8-13(12)17(20)22/h9,14-15H,5-8,10H2,1-4H3
49 atoms
O  -0.405976 0.933155 -0.403016
O  -1.838121 1.851129 1.06141
O  2.762985 1.634367 -2.061732
O  1.532118 0.221965 2.084809
N  1.847487 1.190555 0.013922
C  -2.77309 -1.192002 1.066199
C  -3.806387 -0.290175 0.474993
C  -2.385784 -0.207103 -0.026523
C  -2.320806 -0.957971 2.487486
C  -2.750864 -2.646064 0.660323
C  -4.887487 -0.80559 -0.404536
C  -1.555794 0.971876 0.29318
C  -5.362591 -0.18892 -1.487362
C  0.603772 1.877359 -0.092271
C  -6.476065 -0.780749 -2.297674
C  -4.844722 1.127787 -1.979978
C  3.854647 0.174705 -0.469019
C  3.494275 -0.241671 0.744687
C  5.10198 -0.218653 -1.170691
C  4.286218 -1.156711 1.604149
C  5.733873 -1.41713 -0.458937
C  5.713447 -1.25587 1.061537
C  2.801889 1.086579 -0.995446
C  2.185261 0.373757 1.090196
H  -4.089883 0.542434 1.115021
H  -2.178947 -0.655114 -0.992193
H  -2.420605 0.080237 2.795743
H  -2.921366 -1.563802 3.168475
H  -1.275859 -1.244297 2.61972
H  -3.054565 -2.794473 -0.375951
H  -1.747476 -3.05943 0.775262
H  -3.422798 -3.232731 1.290625
H  -5.340355 -1.748522 -0.110605
H  0.380013 2.390733 0.841617
H  0.682231 2.604817 -0.899659
H  -6.172047 -0.923143 -3.337724
H  -6.800138 -1.744905 -1.907749
H  -7.343957 -0.11704 -2.316026
H  -5.65961 1.850562 -2.066952
H  -4.08865 1.559711 -1.32856
H  -4.413393 1.027122 -2.979453
H  4.893028 -0.446196 -2.218368
H  5.791465 0.631886 -1.18494
H  4.279197 -0.807323 2.639188
H  3.807608 -2.141584 1.621286
H  5.189077 -2.325142 -0.732263
H  6.758222 -1.55503 -0.807269
H  6.265113 -0.352457 1.336969
H  6.231758 -2.091214 1.534267
totalener: -1094.85444078 hartree
nucrepener: 2077.73768661 hartree
electener: -3172.59212739 hartree
oneelecener: -5617.40383161 hartree
twoeener: 2444.81170422 hartree
kineticenergy: 1090.09111081 hartree
xcener: -105.970554626564 hartree
chargesum: 0.0000000
charge: -0.267109 -0.375541 -0.319825 -0.323777 -0.110472 0.122031 -0.009254 -0.122969 -0.247840 -0.275141 -0.243552 0.343152 -0.005792 0.067364 -0.211634 -0.224985 -0.101204 -0.070062 -0.072382 -0.077007 -0.135631 -0.134399 0.266617 0.257917 0.105862 0.088557 0.096982 0.081707 0.092375 0.084943 0.091274 0.089218 0.092924 0.138703 0.114145 0.083879 0.077928 0.087442 0.089662 0.083106 0.087353 0.094608 0.092408 0.094367 0.092634 0.075648 0.080089 0.075639 0.080045
qa: -0.2671 -0.3755 -0.3198 -0.3238 -0.1105 0.1220 -0.0093 -0.1230 -0.2478 -0.2751 -0.2436 0.3432 -0.0058 0.0674 -0.2116 -0.2250 -0.1012 -0.0701 -0.0724 -0.0770 -0.1356 -0.1344 0.2666 0.2579 0.1059 0.0886 0.0970 0.0817 0.0924 0.0849 0.0913 0.0892 0.0929 0.1387 0.1141 0.0839 0.0779 0.0874 0.0897 0.0831 0.0874 0.0946 0.0924 0.0944 0.0926 0.0756 0.0801 0.0756 0.0800
va: 2.1053 2.1279 2.1948 2.1830 3.0892 3.7668 3.8146 3.8271 3.9028 3.9059 3.9030 4.1906 3.7341 3.8841 3.9419 3.9392 3.6573 3.6113 3.9238 3.9269 3.8992 3.8979 4.2800 4.2707 1.0264 1.0292 1.0200 1.0017 1.0073 1.0049 1.0061 1.0020 1.0095 1.0143 1.0112 0.9991 1.0096 0.9986 1.0022 1.0189 1.0005 1.0192 1.0082 1.0190 1.0083 1.0087 1.0117 1.0088 1.0119
dispcorr: -0.023222188 hartree
energy: -1094.877662965663
dipole: -15.66786 16.78779 1.11993 -15.44480 14.32586 -1.11894 -2.17982 1.90921 -0.27061
magnitude: 1.60608 au
magnitude: 4.08234 debye
