program: Orca
programVersion: 5.0.2
elementType: O O O O N C C C C C C C C C C C C C C C C C C C H H H H H H H H H H H H H H H H H H H H H H H H H
charge: 0
multiplicity: 1
keywords: wb97x-d3
keywords: def2-TZVPP
keywords: def2/J RIJCOSX
keywords: DEFGRID2
keywords: scfconv7
keywords: smallprint printgap noloewdin
keywords: NOSOSCF
formula: C19H25NO4
InChI: InChI=1/C19H25NO4/c1-11(2)9-14-15(19(14,3)4)18(23)24-10-20-16(21)12-7-5-6-8-13(12)17(20)22/h9,14-15H,5-8,10H2,1-4H3
49 atoms
O  -0.309688 -1.138129 -0.21958
O  -1.55902 -1.073824 -2.084752
O  1.56989 0.979944 -1.837555
O  2.879378 -2.266667 1.068274
N  1.964411 -0.896297 -0.551915
C  -2.786129 1.343297 -0.428904
C  -3.756264 0.216813 -0.564994
C  -2.360051 -0.07195 -0.066993
C  -2.245867 2.004638 -1.673557
C  -2.923032 2.291574 0.737741
C  -4.92514 0.074856 0.342003
C  -1.407081 -0.804453 -0.924635
C  -5.428633 -1.080308 0.778641
C  0.812154 -1.654091 -0.913745
C  -6.635515 -1.120808 1.666512
C  -4.856058 -2.417056 0.41883
C  3.417484 0.867383 -0.279078
C  3.797777 -0.08063 0.576886
C  4.082264 2.183078 -0.448401
C  4.963776 0.013756 1.490863
C  5.030043 2.431521 0.727043
C  5.85109 1.187751 1.070023
C  2.215355 0.392424 -1.014661
C  2.867677 -1.23703 0.453488
H  -3.92508 -0.105819 -1.589774
H  -2.246357 -0.256184 0.995506
H  -1.236731 2.386359 -1.509406
H  -2.209456 1.332954 -2.527813
H  -2.881853 2.849609 -1.944444
H  -1.960144 2.747866 0.972835
H  -3.619645 3.098245 0.499143
H  -3.284803 1.797063 1.639254
H  -5.420479 0.994978 0.639859
H  0.65876 -1.606014 -1.990575
H  0.974849 -2.687651 -0.611342
H  -6.422973 -1.657622 2.594222
H  -6.986949 -0.123565 1.928397
H  -7.459727 -1.650987 1.18315
H  -4.542317 -2.959285 1.314599
H  -5.611275 -3.038364 -0.069039
H  -4.001503 -2.348307 -0.250478
H  4.628559 2.193143 -1.3971
H  3.336525 2.976979 -0.529696
H  4.608203 0.14465 2.518029
H  5.524359 -0.923678 1.490399
H  5.693217 3.266617 0.49668
H  4.446246 2.732012 1.601971
H  6.563144 1.415769 1.864533
H  6.443653 0.89571 0.198034
totalener: -1094.85430063 hartree
nucrepener: 2082.04243905 hartree
electener: -3176.89673968 hartree
oneelecener: -5626.02642792 hartree
twoeener: 2449.12968824 hartree
kineticenergy: 1090.08950894 hartree
xcener: -105.970053035785 hartree
chargesum: -0.0000000
charge: -0.268481 -0.373465 -0.322081 -0.319483 -0.112484 0.123363 -0.016625 -0.119963 -0.245351 -0.275724 -0.238525 0.342523 -0.007534 0.067752 -0.211850 -0.224326 -0.070443 -0.101232 -0.073587 -0.074262 -0.135535 -0.136331 0.253688 0.270647 0.107194 0.087675 0.089065 0.098435 0.082565 0.090308 0.089633 0.085001 0.092728 0.139538 0.113559 0.083580 0.078080 0.087537 0.086023 0.089451 0.082899 0.092606 0.093539 0.093725 0.093656 0.080477 0.075726 0.080473 0.075837
qa: -0.2685 -0.3735 -0.3221 -0.3195 -0.1125 0.1234 -0.0166 -0.1200 -0.2454 -0.2757 -0.2385 0.3425 -0.0075 0.0678 -0.2119 -0.2243 -0.0704 -0.1012 -0.0736 -0.0743 -0.1355 -0.1363 0.2537 0.2706 0.1072 0.0877 0.0891 0.0984 0.0826 0.0903 0.0896 0.0850 0.0927 0.1395 0.1136 0.0836 0.0781 0.0875 0.0860 0.0895 0.0829 0.0926 0.0935 0.0937 0.0937 0.0805 0.0757 0.0805 0.0758
va: 2.1057 2.1308 2.1847 2.1954 3.0894 3.7668 3.8241 3.8231 3.8993 3.9067 3.8975 4.1906 3.7348 3.8850 3.9415 3.9404 3.6120 3.6535 3.9246 3.9242 3.8984 3.8976 4.2726 4.2785 1.0260 1.0302 1.0084 1.0205 1.0015 1.0066 1.0017 1.0048 1.0093 1.0159 1.0112 0.9995 1.0097 0.9982 1.0010 1.0019 1.0187 1.0082 1.0196 1.0083 1.0193 1.0117 1.0087 1.0117 1.0085
dispcorr: -0.023306296 hartree
energy: -1094.877606929637
dipole: -17.58730 18.52518 0.93788 10.88045 -10.00275 0.87770 8.84474 -7.92652 0.91822
magnitude: 1.57896 au
magnitude: 4.01338 debye
