program: Orca
programVersion: 5.0.2
elementType: O O O O N C C C C C C C C C C C C C C C C C C C H H H H H H H H H H H H H H H H H H H H H H H H H
charge: 0
multiplicity: 1
keywords: wb97x-d3
keywords: def2-TZVPP
keywords: def2/J RIJCOSX
keywords: DEFGRID2
keywords: scfconv7
keywords: smallprint printgap noloewdin
keywords: NOSOSCF
formula: C19H25NO4
InChI: InChI=1/C19H25NO4/c1-11(2)9-14-15(19(14,3)4)18(23)24-10-20-16(21)12-7-5-6-8-13(12)17(20)22/h9,14-15H,5-8,10H2,1-4H3
49 atoms
O  -0.359053 0.831723 0.034457
O  -1.934385 1.665714 1.388787
O  2.468308 1.889257 -1.703621
O  1.897069 -0.120758 2.337957
N  1.884748 1.138277 0.40204
C  -2.82806 -1.397602 0.930296
C  -3.841544 -0.402913 0.463468
C  -2.406393 -0.248607 0.030252
C  -2.421206 -1.396894 2.383735
C  -2.791566 -2.767514 0.29766
C  -4.895067 -0.74605 -0.526886
C  -1.586069 0.854987 0.572336
C  -5.399547 0.100827 -1.425319
C  0.606351 1.743117 0.540151
C  -6.486914 -0.31567 -2.36858
C  -4.938016 1.519574 -1.563423
C  3.808822 0.266293 -0.510512
C  3.641046 -0.325134 0.67195
C  4.934149 0.006605 -1.442433
C  4.559813 -1.330518 1.262111
C  5.662637 -1.270766 -1.019659
C  5.882155 -1.32773 0.492603
C  2.677764 1.204761 -0.741928
C  2.390415 0.190033 1.290134
H  -4.141993 0.314832 1.223102
H  -2.163712 -0.531083 -0.988454
H  -2.503086 -0.41432 2.844464
H  -3.06105 -2.077892 2.94805
H  -1.390068 -1.7357 2.502909
H  -3.484439 -3.444714 0.801487
H  -3.058607 -2.745357 -0.758857
H  -1.792379 -3.198773 0.377915
H  -5.299664 -1.753302 -0.484342
H  0.419467 1.966722 1.589448
H  0.586027 2.667396 -0.037229
H  -7.384541 0.290962 -2.225036
H  -6.180861 -0.175595 -3.408317
H  -6.764932 -1.360797 -2.237921
H  -4.186261 1.798118 -0.828306
H  -4.519147 1.696164 -2.557636
H  -5.779028 2.209027 -1.455987
H  4.566807 -0.068234 -2.468283
H  5.616044 0.863196 -1.434428
H  4.718927 -1.124744 2.322931
H  4.087757 -2.317512 1.220434
H  5.075478 -2.138894 -1.33278
H  6.618668 -1.339891 -1.540503
H  6.476319 -0.463619 0.803713
H  6.463541 -2.213017 0.753926
totalener: -1094.85474503 hartree
nucrepener: 2068.59026910 hartree
electener: -3163.44501414 hartree
oneelecener: -5599.00816855 hartree
twoeener: 2435.56315442 hartree
kineticenergy: 1090.10254954 hartree
xcener: -105.971561865034 hartree
chargesum: -0.0000000
charge: -0.259512 -0.377131 -0.317027 -0.321903 -0.122552 0.127360 -0.018277 -0.101392 -0.251931 -0.278849 -0.240221 0.326282 -0.006710 0.081213 -0.211454 -0.224270 -0.093721 -0.076230 -0.076307 -0.074982 -0.135699 -0.135174 0.265475 0.259481 0.104911 0.085802 0.094864 0.083897 0.094913 0.091481 0.083902 0.091128 0.093085 0.128220 0.119036 0.086924 0.083967 0.078227 0.081715 0.086196 0.088087 0.095388 0.092593 0.094252 0.092842 0.075870 0.080108 0.075686 0.080437
qa: -0.2595 -0.3771 -0.3170 -0.3219 -0.1226 0.1274 -0.0183 -0.1014 -0.2519 -0.2788 -0.2402 0.3263 -0.0067 0.0812 -0.2115 -0.2243 -0.0937 -0.0762 -0.0763 -0.0750 -0.1357 -0.1352 0.2655 0.2595 0.1049 0.0858 0.0949 0.0839 0.0949 0.0915 0.0839 0.0911 0.0931 0.1282 0.1190 0.0869 0.0840 0.0782 0.0817 0.0862 0.0881 0.0954 0.0926 0.0943 0.0928 0.0759 0.0801 0.0757 0.0804
va: 2.1147 2.1176 2.1965 2.1855 3.1079 3.7715 3.8257 3.8244 3.8998 3.9062 3.9065 4.2054 3.7302 3.9003 3.9421 3.9397 3.6444 3.6191 3.9239 3.9268 3.8993 3.8966 4.2792 4.2729 1.0267 1.0299 1.0188 1.0018 1.0043 1.0010 1.0047 1.0064 1.0091 1.0120 1.0041 0.9985 0.9991 1.0096 1.0231 1.0006 1.0022 1.0192 1.0078 1.0187 1.0085 1.0089 1.0116 1.0086 1.0117
dispcorr: -0.022880556 hartree
energy: -1094.877625587939
dipole: -16.06311 17.22368 1.16057 -14.35254 13.28727 -1.06527 -5.92410 5.36510 -0.55899
magnitude: 1.67159 au
magnitude: 4.24883 debye
