program: Orca
programVersion: 5.0.2
elementType: O O O O N C C C C C C C C C C C C C C C C C C C H H H H H H H H H H H H H H H H H H H H H H H H H
charge: 0
multiplicity: 1
keywords: wb97x-d3
keywords: def2-TZVPP
keywords: def2/J RIJCOSX
keywords: DEFGRID2
keywords: scfconv7
keywords: smallprint printgap noloewdin
keywords: NOSOSCF
formula: C19H25NO4
InChI: InChI=1/C19H25NO4/c1-11(2)9-14-15(19(14,3)4)18(23)24-10-20-16(21)12-7-5-6-8-13(12)17(20)22/h9,14-15H,5-8,10H2,1-4H3
49 atoms
O  0.353637 -1.149023 0.35327
O  1.441936 -0.476634 2.199299
O  -1.410286 1.22513 1.469948
O  -2.969743 -2.485291 -0.634718
N  -1.933382 -0.850542 0.623201
C  2.809425 1.443523 0.117225
C  3.744658 0.345521 0.488593
C  2.344256 -0.008397 0.035024
C  2.284467 2.361698 1.193452
C  2.978809 2.132005 -1.215158
C  4.918274 0.001184 -0.356134
C  1.369462 -0.5443 0.994938
C  5.338687 -1.233276 -0.643196
C  -0.788003 -1.562644 1.091946
C  6.552692 -1.463128 -1.490677
C  4.661295 -2.476814 -0.157657
C  -3.360465 0.872403 0.073479
C  -3.818443 -0.219916 -0.540132
C  -3.993203 2.212191 0.016664
C  -5.036081 -0.277734 -1.384618
C  -5.415473 2.080469 -0.531094
C  -5.481196 1.14281 -1.7361
C  -2.129449 0.510265 0.815759
C  -2.906922 -1.3499 -0.234521
H  3.898241 0.233689 1.559783
H  2.245427 -0.395505 -0.972687
H  2.9204 3.246933 1.252156
H  2.275589 1.906873 2.181228
H  1.272267 2.701343 0.96571
H  3.305966 1.450777 -2.00044
H  3.714939 2.934921 -1.140903
H  2.0361 2.579192 -1.535294
H  5.488721 0.840761 -0.744666
H  -0.655381 -1.396879 2.158415
H  -0.942915 -2.62495 0.918471
H  6.304945 -2.055058 -2.375503
H  7.31036 -2.029677 -0.943679
H  7.004433 -0.529351 -1.824608
H  3.806715 -2.281735 0.487125
H  5.364674 -3.099349 0.400999
H  4.318431 -3.08374 -0.999672
H  -3.995574 2.674607 1.00603
H  -3.39141 2.866805 -0.621816
H  -4.84781 -0.86358 -2.287022
H  -5.824545 -0.806983 -0.840132
H  -6.069996 1.701356 0.258388
H  -5.792909 3.066346 -0.80446
H  -4.841485 1.532067 -2.532911
H  -6.496332 1.117079 -2.133786
elementType: O N C H
totalener: -1094.86817547 hartree
nucrepener: 2087.83899849 hartree
electener: -3182.70717396 hartree
oneelecener: -5638.13970193 hartree
twoeener: 2455.43252797 hartree
cpcmener: -0.03727446 hartree
kineticenergy: 1090.03472671 hartree
xcener: -105.973063941684 hartree
chargesum: 0.0000000
charge: -0.287977 -0.484034 -0.441858 -0.434709 -0.092144 0.152332 -0.001069 -0.132291 -0.288096 -0.284602 -0.302018 0.415785 -0.016658 0.077912 -0.228708 -0.240434 -0.057459 -0.082432 -0.072957 -0.068016 -0.132952 -0.136574 0.339662 0.343722 0.104240 0.101033 0.099543 0.094689 0.094740 0.094462 0.099835 0.098870 0.123820 0.142807 0.125713 0.094943 0.096514 0.090002 0.083977 0.102403 0.099402 0.093453 0.102379 0.092842 0.101679 0.078314 0.080806 0.078591 0.080518
qa: -0.2880 -0.4840 -0.4419 -0.4347 -0.0921 0.1523 -0.0011 -0.1323 -0.2881 -0.2846 -0.3020 0.4158 -0.0167 0.0779 -0.2287 -0.2404 -0.0575 -0.0824 -0.0730 -0.0680 -0.1330 -0.1366 0.3397 0.3437 0.1042 0.1010 0.0995 0.0947 0.0947 0.0945 0.0998 0.0989 0.1238 0.1428 0.1257 0.0949 0.0965 0.0900 0.0840 0.1024 0.0994 0.0935 0.1024 0.0928 0.1017 0.0783 0.0808 0.0786 0.0805
va: 2.0995 2.0191 2.0652 2.0775 3.1010 3.6889 3.8071 3.8300 3.8899 3.9074 3.8913 4.1210 3.7150 3.8588 3.9293 3.9335 3.6737 3.7162 3.9187 3.9159 3.9153 3.9201 4.1847 4.1941 1.0236 1.0288 1.0024 1.0163 1.0064 1.0023 1.0002 1.0025 1.0033 1.0152 1.0161 0.9969 0.9961 1.0061 1.0113 0.9989 0.9988 1.0153 1.0044 1.0159 1.0044 1.0067 1.0095 1.0064 1.0094
dispcorr: -0.023465987 hartree
energy: -1094.891641456598
dipole: 17.28967 -18.46241 -1.17275 9.08838 -8.31915 0.76923 -10.62109 8.98791 -1.63319
magnitude: 2.15275 au
magnitude: 5.47186 debye
