program: Orca
programVersion: 5.0.2
elementType: O O O O N C C C C C C C C C C C C C C C C C C C H H H H H H H H H H H H H H H H H H H H H H H H H
charge: 0
multiplicity: 1
keywords: wb97x-d3
keywords: def2-TZVPP
keywords: def2/J RIJCOSX
keywords: DEFGRID2
keywords: scfconv7
keywords: smallprint printgap noloewdin
keywords: NOSOSCF
formula: C19H25NO4
InChI: InChI=1/C19H25NO4/c1-11(2)9-14-15(19(14,3)4)18(23)24-10-20-16(21)12-7-5-6-8-13(12)17(20)22/h9,14-15H,5-8,10H2,1-4H3
49 atoms
O  0.516509 1.866374 -1.104044
O  0.664252 1.513546 1.100178
O  -1.64659 0.112553 -2.502894
O  -2.344488 2.132504 1.510422
N  -1.755425 1.416377 -0.60677
C  3.70622 1.060481 0.524433
C  3.0296 -0.271556 0.461853
C  2.474195 0.896748 -0.346959
C  3.644763 1.835374 1.81833
C  5.000715 1.279395 -0.221848
C  3.574976 -1.428117 -0.272481
C  1.156403 1.444988 -0.001424
C  3.539325 -2.707872 0.113862
C  -0.789631 2.406208 -0.9679
C  4.097735 -3.786518 -0.765505
C  2.95675 -3.201174 1.402491
C  -3.021376 -0.509821 -0.606488
C  -3.21513 0.081381 0.57297
C  -3.661104 -1.775476 -1.041562
C  -4.090685 -0.434212 1.652853
C  -4.816124 -2.113556 -0.09702
C  -4.438632 -1.895571 1.367367
C  -2.076011 0.317573 -1.394555
C  -2.411347 1.327248 0.616429
H  2.443369 -0.504907 1.344038
H  2.676172 0.862701 -1.411386
H  4.548108 1.636248 2.39769
H  2.795442 1.569351 2.442665
H  3.606339 2.910269 1.632221
H  5.841316 0.886444 0.35334
H  5.173829 2.34644 -0.372179
H  5.014983 0.804891 -1.201732
H  4.028622 -1.207287 -1.234376
H  -1.023163 2.819573 -1.94555
H  -0.820653 3.210047 -0.23328
H  4.501299 -3.392155 -1.697653
H  3.326971 -4.520289 -1.015614
H  4.893176 -4.33744 -0.257454
H  2.11746 -3.87423 1.212177
H  2.604735 -2.41158 2.062046
H  3.696889 -3.78478 1.954216
H  -4.011632 -1.691044 -2.072568
H  -2.913156 -2.574589 -1.040637
H  -3.600805 -0.330228 2.623554
H  -4.997166 0.177098 1.704344
H  -5.678105 -1.487981 -0.344825
H  -5.124598 -3.1476 -0.254607
H  -3.579581 -2.52448 1.617177
H  -5.256618 -2.209714 2.016513
elementType: O N C H
totalener: -1094.86979960 hartree
nucrepener: 2109.38711438 hartree
electener: -3204.25691398 hartree
oneelecener: -5681.53813758 hartree
twoeener: 2477.28122359 hartree
cpcmener: -0.04093875 hartree
kineticenergy: 1090.04521583 hartree
xcener: -105.975847136967 hartree
chargesum: 0.0000000
charge: -0.288416 -0.492199 -0.435551 -0.430755 -0.103287 0.107391 0.040845 -0.109415 -0.277243 -0.272348 -0.282210 0.435575 -0.051398 0.084972 -0.217004 -0.253444 -0.076941 -0.067007 -0.070761 -0.078482 -0.137734 -0.133148 0.335359 0.338251 0.099572 0.088926 0.095670 0.091192 0.100150 0.098030 0.097462 0.090262 0.121519 0.147230 0.133573 0.088630 0.093604 0.093851 0.098032 0.090337 0.095781 0.093711 0.102501 0.093634 0.102220 0.078340 0.081241 0.078407 0.081074
qa: -0.2884 -0.4922 -0.4356 -0.4308 -0.1033 0.1074 0.0408 -0.1094 -0.2772 -0.2723 -0.2822 0.4356 -0.0514 0.0850 -0.2170 -0.2534 -0.0769 -0.0670 -0.0708 -0.0785 -0.1377 -0.1331 0.3354 0.3383 0.0996 0.0889 0.0957 0.0912 0.1002 0.0980 0.0975 0.0903 0.1215 0.1472 0.1336 0.0886 0.0936 0.0939 0.0980 0.0903 0.0958 0.0937 0.1025 0.0936 0.1022 0.0783 0.0812 0.0784 0.0811
va: 2.1126 2.0157 2.0741 2.0785 3.0866 3.6834 3.7750 3.8315 3.8997 3.9147 3.8789 4.1234 3.7643 3.8856 3.9188 3.9405 3.7022 3.6679 3.9156 3.9183 3.9180 3.9150 4.1903 4.1841 1.0270 1.0376 0.9998 1.0198 0.9994 1.0013 1.0015 1.0061 1.0109 0.9934 1.0161 1.0090 0.9959 0.9965 0.9964 1.0106 0.9972 1.0153 1.0046 1.0155 1.0042 1.0065 1.0093 1.0067 1.0094
dispcorr: -0.022610044 hartree
energy: -1094.892409648369
dipole: 18.47287 -18.80902 -0.33615 -19.33711 17.93303 -1.40408 6.49116 -6.79337 -0.30221
magnitude: 1.47505 au
magnitude: 3.74928 debye
