program: Orca
programVersion: 5.0.2
elementType: O O O O N C C C C C C C C C C C C C C C C C C C H H H H H H H H H H H H H H H H H H H H H H H H H
charge: 0
multiplicity: 1
keywords: wb97x-d3
keywords: def2-TZVPP
keywords: def2/J RIJCOSX
keywords: DEFGRID2
keywords: scfconv7
keywords: smallprint printgap noloewdin
keywords: NOSOSCF
formula: C19H25NO4
InChI: InChI=1/C19H25NO4/c1-11(2)9-14-15(19(14,3)4)18(23)24-10-20-16(21)12-7-5-6-8-13(12)17(20)22/h9,14-15H,5-8,10H2,1-4H3
49 atoms
O  0.485126 1.668799 -1.312601
O  0.570059 1.468209 0.913245
O  -2.394929 2.222729 1.237346
O  -1.729093 -0.130962 -2.597026
N  -1.808625 1.322673 -0.811975
C  3.635569 1.097201 0.424965
C  3.01368 -0.25895 0.533711
C  2.423876 0.758472 -0.429739
C  3.519955 2.036427 1.600009
C  4.935975 1.259572 -0.32506
C  3.658214 -1.46956 -0.012971
C  1.092616 1.323406 -0.166788
C  3.875834 -2.615507 0.641037
C  -0.810706 2.249312 -1.245097
C  4.562617 -3.764248 -0.034392
C  3.48973 -2.874913 2.064839
C  -3.320459 0.133266 0.454687
C  -3.131238 -0.559269 -0.669019
C  -4.22119 -0.266923 1.561847
C  -3.797263 -1.839878 -1.006085
C  -4.602724 -1.738658 1.396199
C  -4.967411 -2.074572 -0.048584
C  -2.478789 1.353262 0.407226
C  -2.157112 0.175012 -1.51151
H  2.426588 -0.400633 1.43484
H  2.643188 0.59553 -1.478843
H  4.413429 1.943857 2.220562
H  2.663471 1.828537 2.236396
H  3.456645 3.075505 1.271175
H  4.987245 0.651806 -1.227339
H  5.777644 0.98167 0.312234
H  5.075551 2.300541 -0.62149
H  3.994585 -1.40511 -1.043857
H  -1.019663 2.578415 -2.259895
H  -0.82869 3.117546 -0.58716
H  5.476669 -4.040589 0.497734
H  4.82923 -3.537662 -1.066694
H  3.927603 -4.654064 -0.036529
H  2.962923 -2.04893 2.538268
H  4.377419 -3.087643 2.666301
H  2.853346 -3.760677 2.135136
H  -3.739996 -0.093822 2.526998
H  -5.112054 0.368856 1.549309
H  -4.138337 -1.830785 -2.043845
H  -3.067355 -2.652817 -0.935787
H  -3.763349 -2.364154 1.713269
H  -5.436941 -1.975476 2.057536
H  -5.814837 -1.457303 -0.360308
H  -5.293529 -3.112838 -0.120362
elementType: O N C H
totalener: -1094.86985492 hartree
nucrepener: 2099.56269069 hartree
electener: -3194.43254561 hartree
oneelecener: -5661.93276574 hartree
twoeener: 2467.50022013 hartree
cpcmener: -0.04069944 hartree
kineticenergy: 1090.04004492 hartree
xcener: -105.974887967927 hartree
chargesum: -0.0000000
charge: -0.288391 -0.492835 -0.430212 -0.436651 -0.102769 0.116263 0.043585 -0.130337 -0.280685 -0.269353 -0.286199 0.442821 -0.046397 0.084617 -0.218832 -0.252118 -0.067517 -0.077038 -0.077908 -0.071170 -0.133076 -0.138184 0.339127 0.336822 0.097642 0.089151 0.095656 0.092147 0.100432 0.089712 0.097756 0.098627 0.123452 0.147189 0.134550 0.093972 0.088911 0.093833 0.089755 0.097142 0.095903 0.093257 0.102418 0.093254 0.102775 0.078840 0.080603 0.078606 0.080855
qa: -0.2884 -0.4928 -0.4302 -0.4367 -0.1028 0.1163 0.0436 -0.1303 -0.2807 -0.2694 -0.2862 0.4428 -0.0464 0.0846 -0.2188 -0.2521 -0.0675 -0.0770 -0.0779 -0.0712 -0.1331 -0.1382 0.3391 0.3368 0.0976 0.0892 0.0957 0.0921 0.1004 0.0897 0.0978 0.0986 0.1235 0.1472 0.1346 0.0940 0.0889 0.0938 0.0898 0.0971 0.0959 0.0933 0.1024 0.0933 0.1028 0.0788 0.0806 0.0786 0.0809
va: 2.1139 2.0140 2.0789 2.0734 3.0873 3.6737 3.7657 3.8664 3.9018 3.9123 3.8694 4.1160 3.7544 3.8850 3.9193 3.9414 3.6652 3.7021 3.9183 3.9158 3.9154 3.9187 4.1825 4.1893 1.0289 1.0381 1.0001 1.0195 0.9992 1.0057 1.0019 1.0018 1.0091 0.9934 1.0153 0.9959 1.0086 0.9963 1.0102 0.9970 0.9970 1.0158 1.0039 1.0155 1.0044 1.0064 1.0094 1.0062 1.0092
dispcorr: -0.022601136 hartree
energy: -1094.892456059179
dipole: 19.96607 -20.22119 -0.25512 -17.58405 16.28892 -1.29513 9.53556 -9.66895 -0.13340
magnitude: 1.32674 au
magnitude: 3.37230 debye
