program: Orca
programVersion: 5.0.2
elementType: O O O O N C C C C C C C C C C C C C C C C C C C H H H H H H H H H H H H H H H H H H H H H H H H H
charge: 0
multiplicity: 1
keywords: wb97x-d3
keywords: def2-TZVPP
keywords: def2/J RIJCOSX
keywords: DEFGRID2
keywords: scfconv7
keywords: smallprint printgap noloewdin
keywords: NOSOSCF
formula: C19H25NO4
InChI: InChI=1/C19H25NO4/c1-11(2)9-14-15(19(14,3)4)18(23)24-10-20-16(21)12-7-5-6-8-13(12)17(20)22/h9,14-15H,5-8,10H2,1-4H3
49 atoms
O  0.521042 1.687142 -1.324187
O  0.567859 1.567793 0.907784
O  -2.409595 2.278275 1.153722
O  -1.631978 -0.207355 -2.574763
N  -1.774192 1.314429 -0.850761
C  3.635383 1.133929 0.535241
C  3.004065 -0.221357 0.567675
C  2.457246 0.841906 -0.378774
C  3.482868 2.022003 1.745453
C  4.962753 1.32684 -0.159078
C  3.648421 -1.414876 -0.011245
C  1.113771 1.393709 -0.156205
C  3.688389 -2.640893 0.521442
C  -0.786701 2.243196 -1.302799
C  4.391843 -3.75862 -0.188689
C  3.07065 -3.030838 1.829102
C  -3.268458 0.133891 0.445896
C  -3.039592 -0.600703 -0.643265
C  -4.194455 -0.232154 1.544551
C  -3.645511 -1.924596 -0.922453
C  -5.085449 -1.39053 1.09248
C  -4.29003 -2.466452 0.354929
C  -2.457925 1.373019 0.360002
C  -2.0809 0.129084 -1.506956
H  2.37997 -0.392852 1.43799
H  2.718036 0.71176 -1.422862
H  4.355965 1.899204 2.389067
H  2.60584 1.790649 2.34432
H  3.432919 3.074361 1.4596
H  5.04447 0.767181 -1.089436
H  5.781225 1.014569 0.492297
H  5.113822 2.381194 -0.396918
H  4.139288 -1.268485 -0.968916
H  -0.983065 2.526801 -2.333382
H  -0.833557 3.136546 -0.681198
H  5.191262 -4.173551 0.430545
H  4.829695 -3.437147 -1.133388
H  3.704872 -4.582961 -0.396882
H  2.344868 -3.835149 1.685237
H  2.564448 -2.214987 2.340711
H  3.831996 -3.423787 2.507519
H  -3.612826 -0.511364 2.428736
H  -4.794881 0.63148 1.839482
H  -4.388342 -1.823181 -1.719858
H  -2.888535 -2.615032 -1.301525
H  -5.588085 -1.822926 1.958227
H  -5.869255 -1.005271 0.434427
H  -4.937017 -3.308863 0.108448
H  -3.507844 -2.852678 1.014338
elementType: O N C H
totalener: -1094.86978942 hartree
nucrepener: 2106.25129231 hartree
electener: -3201.12108173 hartree
oneelecener: -5675.29054247 hartree
twoeener: 2474.16946074 hartree
cpcmener: -0.04083966 hartree
kineticenergy: 1090.04135888 hartree
xcener: -105.975271232089 hartree
chargesum: 0.0000000
charge: -0.289156 -0.492955 -0.430271 -0.436043 -0.103269 0.110392 0.041858 -0.117683 -0.279017 -0.273330 -0.282128 0.440667 -0.051462 0.084882 -0.218089 -0.251854 -0.066595 -0.078025 -0.073805 -0.074345 -0.135701 -0.137040 0.338883 0.334465 0.100910 0.088914 0.095646 0.091667 0.100016 0.090411 0.097986 0.097923 0.121828 0.146255 0.134861 0.093714 0.089100 0.093974 0.096992 0.089294 0.096585 0.102922 0.094103 0.102061 0.093964 0.081175 0.078581 0.081355 0.079382
qa: -0.2892 -0.4930 -0.4303 -0.4360 -0.1033 0.1104 0.0419 -0.1177 -0.2790 -0.2733 -0.2821 0.4407 -0.0515 0.0849 -0.2181 -0.2519 -0.0666 -0.0780 -0.0738 -0.0743 -0.1357 -0.1370 0.3389 0.3345 0.1009 0.0889 0.0956 0.0917 0.1000 0.0904 0.0980 0.0979 0.1218 0.1463 0.1349 0.0937 0.0891 0.0940 0.0970 0.0893 0.0966 0.1029 0.0941 0.1021 0.0940 0.0812 0.0786 0.0814 0.0794
va: 2.1125 2.0141 2.0788 2.0742 3.0879 3.6769 3.7769 3.8398 3.8995 3.9143 3.8755 4.1178 3.7624 3.8871 3.9182 3.9398 3.6632 3.7039 3.9167 3.9184 3.9155 3.9156 4.1868 4.1892 1.0255 1.0374 0.9998 1.0202 0.9995 1.0064 1.0014 1.0014 1.0102 0.9937 1.0149 0.9962 1.0088 0.9963 0.9967 1.0112 0.9970 1.0045 1.0158 1.0047 1.0152 1.0092 1.0065 1.0092 1.0066
dispcorr: -0.022594185 hartree
energy: -1094.892383605986
dipole: 19.01962 -19.27788 -0.25825 -17.98582 16.60804 -1.37778 9.62572 -9.73240 -0.10667
magnitude: 1.40583 au
magnitude: 3.57333 debye
