program: Orca
programVersion: 5.0.2
elementType: O O O O N C C C C C C C C C C C C C C C C C C C H H H H H H H H H H H H H H H H H H H H H H H H H
charge: 0
multiplicity: 1
keywords: wb97x-d3
keywords: def2-TZVPP
keywords: def2/J RIJCOSX
keywords: DEFGRID2
keywords: scfconv7
keywords: smallprint printgap noloewdin
keywords: NOSOSCF
formula: C19H25NO4
InChI: InChI=1/C19H25NO4/c1-11(2)9-14-15(19(14,3)4)18(23)24-10-20-16(21)12-7-5-6-8-13(12)17(20)22/h9,14-15H,5-8,10H2,1-4H3
49 atoms
O  0.467912 1.834739 -1.046768
O  0.670258 1.33539 1.123849
O  -1.814149 0.298433 -2.512853
O  -2.277057 1.979312 1.687363
N  -1.803692 1.43733 -0.51081
C  3.70013 1.0339 0.363408
C  3.072429 -0.322846 0.431378
C  2.419342 0.76229 -0.40939
C  3.684139 1.892097 1.604284
C  4.933218 1.250358 -0.479894
C  3.641188 -1.504137 -0.244657
C  1.125312 1.322302 0.004384
C  3.772053 -2.730129 0.273668
C  -0.810897 2.414037 -0.830146
C  4.372793 -3.841107 -0.534377
C  3.363602 -3.126643 1.659349
C  -3.125732 -0.447764 -0.616523
C  -3.260433 0.051522 0.61269
C  -3.800471 -1.669019 -1.11903
C  -4.130851 -0.51005 1.673508
C  -4.383145 -2.447481 0.062142
C  -5.089956 -1.531404 1.060159
C  -2.190965 0.419219 -1.37332
C  -2.410844 1.261554 0.728818
H  2.558318 -0.517873 1.366362
H  2.549009 0.67732 -1.48242
H  4.620678 1.753608 2.147461
H  2.875561 1.646878 2.288587
H  3.606558 2.950833 1.349887
H  4.911959 0.697885 -1.418112
H  5.826931 0.944952 0.067774
H  5.041806 2.308259 -0.725484
H  3.982436 -1.350877 -1.264463
H  -1.056214 2.905198 -1.768239
H  -0.786932 3.163675 -0.040168
H  5.265329 -4.241497 -0.046315
H  4.652358 -3.51842 -1.537225
H  3.674179 -4.676445 -0.630393
H  2.649953 -3.953806 1.626273
H  2.912425 -2.322959 2.237435
H  4.228234 -3.490643 2.220346
H  -4.589476 -1.383111 -1.821732
H  -3.098888 -2.284472 -1.68666
H  -3.506807 -0.975793 2.442591
H  -4.681428 0.289172 2.175001
H  -5.077667 -3.202591 -0.307434
H  -3.577247 -2.983718 0.570756
H  -5.549372 -2.122557 1.853009
H  -5.901032 -1.002083 0.552414
elementType: O N C H
totalener: -1094.87023438 hartree
nucrepener: 2101.62516983 hartree
electener: -3196.49540421 hartree
oneelecener: -5666.02919727 hartree
twoeener: 2469.53379306 hartree
cpcmener: -0.04096077 hartree
kineticenergy: 1090.04316752 hartree
xcener: -105.975541601203 hartree
chargesum: -0.0000000
charge: -0.287514 -0.492613 -0.435577 -0.430608 -0.103480 0.104823 0.042595 -0.115807 -0.276630 -0.271740 -0.282963 0.441284 -0.050858 0.084741 -0.216865 -0.253595 -0.082345 -0.064133 -0.072847 -0.073466 -0.134407 -0.136729 0.336679 0.338954 0.095490 0.089545 0.096319 0.091720 0.100466 0.089840 0.098113 0.098312 0.122352 0.147102 0.133964 0.093545 0.088607 0.093468 0.096371 0.090096 0.097561 0.101568 0.093689 0.102630 0.093685 0.080164 0.078790 0.081808 0.077899
qa: -0.2875 -0.4926 -0.4356 -0.4306 -0.1035 0.1048 0.0426 -0.1158 -0.2766 -0.2717 -0.2830 0.4413 -0.0509 0.0847 -0.2169 -0.2536 -0.0823 -0.0641 -0.0728 -0.0735 -0.1344 -0.1367 0.3367 0.3390 0.0955 0.0895 0.0963 0.0917 0.1005 0.0898 0.0981 0.0983 0.1224 0.1471 0.1340 0.0935 0.0886 0.0935 0.0964 0.0901 0.0976 0.1016 0.0937 0.1026 0.0937 0.0802 0.0788 0.0818 0.0779
va: 2.1125 2.0147 2.0750 2.0784 3.0880 3.6863 3.7701 3.8373 3.9036 3.9140 3.8735 4.1266 3.7639 3.8862 3.9188 3.9410 3.7062 3.6632 3.9200 3.9159 3.9153 3.9176 4.1880 4.1857 1.0299 1.0369 1.0002 1.0187 0.9991 1.0061 1.0015 1.0015 1.0102 0.9941 1.0155 0.9960 1.0087 0.9965 0.9968 1.0105 0.9967 1.0044 1.0152 1.0047 1.0158 1.0094 1.0066 1.0091 1.0065
dispcorr: -0.022569429 hartree
energy: -1094.892803809315
dipole: 19.59118 -19.91045 -0.31928 -18.87258 17.59112 -1.28146 5.98014 -6.32693 -0.34680
magnitude: 1.36541 au
magnitude: 3.47059 debye
