program: Orca
programVersion: 5.0.2
elementType: O O O O N C C C C C C C C C C C C C C C C C C C H H H H H H H H H H H H H H H H H H H H H H H H H
charge: 0
multiplicity: 1
keywords: wb97x-d3
keywords: def2-TZVPP
keywords: def2/J RIJCOSX
keywords: DEFGRID2
keywords: scfconv7
keywords: smallprint printgap noloewdin
keywords: NOSOSCF
formula: C19H25NO4
InChI: InChI=1/C19H25NO4/c1-11(2)9-14-15(19(14,3)4)18(23)24-10-20-16(21)12-7-5-6-8-13(12)17(20)22/h9,14-15H,5-8,10H2,1-4H3
49 atoms
O  0.424603 1.790812 -1.043739
O  0.623461 1.246492 1.116875
O  -1.923401 0.356943 -2.514892
O  -2.290656 2.000409 1.709951
N  -1.857882 1.47219 -0.500073
C  3.648837 0.942242 0.32273
C  3.021946 -0.416032 0.385006
C  2.356472 0.671956 -0.433368
C  3.653626 1.786915 1.572466
C  4.871514 1.154776 -0.535596
C  3.595162 -1.584245 -0.318656
C  1.072714 1.24452 -0.004971
C  4.033179 -2.709887 0.254646
C  -0.830344 2.414534 -0.812033
C  4.593929 -3.826185 -0.573956
C  4.028805 -2.968437 1.730642
C  -3.230857 -0.376084 -0.610772
C  -3.340027 0.114422 0.624635
C  -3.943041 -1.573695 -1.118453
C  -4.215873 -0.43281 1.688358
C  -4.54312 -2.344583 0.059226
C  -5.212525 -1.414376 1.070277
C  -2.282398 0.475124 -1.369207
C  -2.456147 1.298411 0.744722
H  2.52821 -0.628514 1.328139
H  2.474862 0.593799 -1.508537
H  3.598407 2.850416 1.33113
H  4.588668 1.621844 2.111778
H  2.841744 1.550544 2.256535
H  4.990315 2.21379 -0.771419
H  4.828187 0.610344 -1.478122
H  5.769189 0.831879 -0.004653
H  3.666739 -1.503485 -1.399992
H  -1.061051 2.928103 -1.741906
H  -0.773244 3.151539 -0.011942
H  5.628298 -4.041204 -0.292152
H  4.574998 -3.598215 -1.639784
H  4.033312 -4.751409 -0.415783
H  5.048474 -3.13565 2.088376
H  3.469846 -3.878361 1.963708
H  3.605126 -2.155975 2.318099
H  -4.725567 -1.260743 -1.817078
H  -3.261472 -2.205804 -1.692385
H  -3.598767 -0.929421 2.44395
H  -4.734088 0.377292 2.206826
H  -5.263391 -3.074238 -0.312427
H  -3.751421 -2.910234 0.558452
H  -5.687141 -1.997974 1.859765
H  -6.008055 -0.851887 0.573268
elementType: O N C H
totalener: -1094.86982323 hartree
nucrepener: 2095.12469402 hartree
electener: -3189.99451725 hartree
oneelecener: -5653.03680673 hartree
twoeener: 2463.04228947 hartree
cpcmener: -0.04072984 hartree
kineticenergy: 1090.03626961 hartree
xcener: -105.973479765963 hartree
chargesum: -0.0000000
charge: -0.286495 -0.492063 -0.435676 -0.430219 -0.104137 0.133311 0.034341 -0.148719 -0.287214 -0.263466 -0.286383 0.447029 -0.039687 0.085356 -0.222220 -0.253941 -0.082640 -0.061608 -0.072847 -0.073652 -0.134960 -0.137048 0.336627 0.336844 0.095894 0.090088 0.100969 0.096637 0.092565 0.098446 0.089527 0.097224 0.123912 0.146895 0.134042 0.093774 0.089607 0.094265 0.097501 0.096323 0.090673 0.101603 0.093788 0.102578 0.093424 0.080416 0.079107 0.081739 0.078469
qa: -0.2865 -0.4921 -0.4357 -0.4302 -0.1041 0.1333 0.0343 -0.1487 -0.2872 -0.2635 -0.2864 0.4470 -0.0397 0.0854 -0.2222 -0.2539 -0.0826 -0.0616 -0.0728 -0.0737 -0.1350 -0.1370 0.3366 0.3368 0.0959 0.0901 0.1010 0.0966 0.0926 0.0984 0.0895 0.0972 0.1239 0.1469 0.1340 0.0938 0.0896 0.0943 0.0975 0.0963 0.0907 0.1016 0.0938 0.1026 0.0934 0.0804 0.0791 0.0817 0.0785
va: 2.1130 2.0157 2.0750 2.0786 3.0890 3.6709 3.7626 3.8891 3.9052 3.9086 3.8712 4.1205 3.7354 3.8867 3.9216 3.9439 3.7073 3.6613 3.9198 3.9159 3.9155 3.9166 4.1878 4.1858 1.0286 1.0396 0.9990 1.0004 1.0185 1.0024 1.0043 1.0026 1.0079 0.9940 1.0154 0.9963 1.0082 0.9960 0.9969 0.9974 1.0088 1.0045 1.0150 1.0047 1.0160 1.0094 1.0064 1.0091 1.0065
dispcorr: -0.022715065 hartree
energy: -1094.892538296376
dipole: 21.01833 -21.27846 -0.26012 -18.57130 17.36178 -1.20952 5.92683 -6.25622 -0.32939
magnitude: 1.28027 au
magnitude: 3.25419 debye
