program: Orca
programVersion: 5.0.2
elementType: O O O O N C C C C C C C C C C C C C C C C C C C H H H H H H H H H H H H H H H H H H H H H H H H H
charge: 0
multiplicity: 1
keywords: wb97x-d3
keywords: def2-TZVPP
keywords: def2/J RIJCOSX
keywords: DEFGRID2
keywords: scfconv7
keywords: smallprint printgap noloewdin
keywords: NOSOSCF
formula: C19H25NO4
InChI: InChI=1/C19H25NO4/c1-11(2)9-14-15(19(14,3)4)18(23)24-10-20-16(21)12-7-5-6-8-13(12)17(20)22/h9,14-15H,5-8,10H2,1-4H3
49 atoms
O  0.217186 -0.028047 -1.42024
O  1.188737 -2.021244 -1.064926
O  -1.638213 -1.336429 0.755603
O  -3.059087 1.304522 -2.65637
N  -2.0877 -0.187915 -1.188217
C  2.646636 -0.339438 1.163627
C  3.581084 -0.619093 0.027682
C  2.227848 -0.020861 -0.267991
C  2.036896 -1.501084 1.907651
C  2.910981 0.856409 2.042969
C  4.799322 0.194943 -0.207857
C  1.193555 -0.819485 -0.944272
C  6.038516 -0.172259 0.129247
C  -0.961186 -0.618652 -1.95206
C  7.216666 0.707224 -0.159311
C  6.362808 -1.463104 0.815687
C  -3.532539 0.164346 0.569892
C  -3.950646 0.93596 -0.434671
C  -4.175938 0.073898 1.902424
C  -5.147168 1.81146 -0.397802
C  -5.166761 1.228082 2.06843
C  -6.008348 1.444116 0.812005
C  -2.320442 -0.564769 0.126835
C  -3.025391 0.759858 -1.581444
H  3.668535 -1.672517 -0.222137
H  2.207917 1.037542 -0.504327
H  2.652794 -1.734497 2.778331
H  1.968766 -2.407488 1.310563
H  1.036702 -1.257182 2.271871
H  3.306763 1.707143 1.488304
H  3.635293 0.600236 2.819418
H  1.993851 1.17902 2.539832
H  4.659338 1.160867 -0.684608
H  -0.899528 -1.704211 -1.948833
H  -1.084598 -0.276917 -2.977129
H  7.74817 0.963658 0.760689
H  6.927221 1.635175 -0.652135
H  7.939944 0.196315 -0.800072
H  6.873927 -1.272233 1.762628
H  7.049055 -2.063262 0.212902
H  5.485209 -2.070112 1.031225
H  -4.684919 -0.891442 1.992652
H  -3.419666 0.091064 2.691354
H  -4.828382 2.857519 -0.344212
H  -5.716183 1.71609 -1.325701
H  -5.813893 1.031472 2.923867
H  -4.615553 2.14469 2.296191
H  -6.746625 2.227794 0.984973
H  -6.567259 0.530485 0.590564
elementType: O N C H
totalener: -1094.86868673 hartree
nucrepener: 2066.21937850 hartree
electener: -3161.08806524 hartree
oneelecener: -5594.91987691 hartree
twoeener: 2433.83181167 hartree
cpcmener: -0.03781419 hartree
kineticenergy: 1090.03358872 hartree
xcener: -105.972574253378 hartree
chargesum: 0.0000000
charge: -0.286890 -0.479897 -0.442207 -0.434511 -0.091201 0.156575 -0.007147 -0.129541 -0.300925 -0.268901 -0.269644 0.416900 -0.033498 0.078099 -0.230919 -0.249171 -0.054716 -0.085591 -0.070179 -0.073467 -0.135097 -0.135922 0.336932 0.347798 0.098952 0.095332 0.099689 0.095836 0.096035 0.092750 0.096305 0.099991 0.123859 0.143381 0.126027 0.094562 0.090356 0.095457 0.096583 0.099174 0.087073 0.101859 0.093911 0.102604 0.094048 0.081231 0.078555 0.081224 0.078328
qa: -0.2869 -0.4799 -0.4422 -0.4345 -0.0912 0.1566 -0.0071 -0.1295 -0.3009 -0.2689 -0.2696 0.4169 -0.0335 0.0781 -0.2309 -0.2492 -0.0547 -0.0856 -0.0702 -0.0735 -0.1351 -0.1359 0.3369 0.3478 0.0990 0.0953 0.0997 0.0958 0.0960 0.0927 0.0963 0.1000 0.1239 0.1434 0.1260 0.0946 0.0904 0.0955 0.0966 0.0992 0.0871 0.1019 0.0939 0.1026 0.0940 0.0812 0.0786 0.0812 0.0783
va: 2.1088 2.0251 2.0652 2.0785 3.1004 3.6537 3.7916 3.8900 3.8947 3.9071 3.8701 4.1580 3.7006 3.8564 3.9264 3.9413 3.6775 3.7168 3.9168 3.9183 3.9155 3.9160 4.1842 4.1935 1.0235 1.0365 1.0025 1.0158 1.0070 1.0015 1.0025 1.0026 1.0067 1.0146 1.0163 0.9962 1.0074 0.9953 0.9975 0.9981 1.0082 1.0049 1.0154 1.0046 1.0154 1.0094 1.0066 1.0093 1.0066
dispcorr: -0.023088846 hartree
energy: -1094.891775577918
dipole: 21.46322 -22.44562 -0.98240 3.99603 -2.64111 1.35492 17.76113 -16.40714 1.35400
magnitude: 2.15273 au
magnitude: 5.47180 debye
