program: Orca
programVersion: 5.0.2
elementType: O O O O N C C C C C C C C C C C C C C C C C C C H H H H H H H H H H H H H H H H H H H H H H H H H
charge: 0
multiplicity: 1
keywords: wb97x-d3
keywords: def2-TZVPP
keywords: def2/J RIJCOSX
keywords: DEFGRID2
keywords: scfconv7
keywords: smallprint printgap noloewdin
keywords: NOSOSCF
formula: C19H25NO4
InChI: InChI=1/C19H25NO4/c1-11(2)9-14-15(19(14,3)4)18(23)24-10-20-16(21)12-7-5-6-8-13(12)17(20)22/h9,14-15H,5-8,10H2,1-4H3
49 atoms
O  0.506844 1.487741 -0.925061
O  1.276233 2.313087 1.017267
O  -1.315803 0.591333 1.603504
O  -2.645747 1.045081 -2.714962
N  -1.777022 1.162005 -0.580282
C  4.016702 1.203188 -0.050824
C  3.434617 0.276503 0.957259
C  2.576743 0.72838 -0.210869
C  4.318768 2.628305 0.339692
C  4.980826 0.654236 -1.074314
C  3.851987 -1.145121 1.066418
C  1.422529 1.595976 0.056104
C  3.02645 -2.175709 1.265527
C  -0.749635 2.133941 -0.778515
C  3.542938 -3.577264 1.376508
C  1.538961 -2.034443 1.37774
C  -3.010058 -0.564964 0.317532
C  -3.402743 -0.428918 -0.949967
C  -3.564881 -1.543277 1.283532
C  -4.455395 -1.239316 -1.608524
C  -4.879471 -2.102174 0.737717
C  -4.773899 -2.460566 -0.744092
C  -1.942623 0.426727 0.586015
C  -2.606331 0.654904 -1.575354
H  3.166975 0.752218 1.898365
H  2.421737 0.003618 -1.001602
H  4.197122 3.30238 -0.510183
H  5.357078 2.700996 0.668871
H  3.696509 2.99345 1.153244
H  5.996704 0.643258 -0.674322
H  4.98613 1.279063 -1.969008
H  4.732855 -0.361931 -1.380871
H  4.918879 -1.341614 1.002014
H  -0.95368 2.671348 -1.701176
H  -0.743921 2.843439 0.045134
H  3.083492 -4.222625 0.623488
H  3.291194 -4.010502 2.347641
H  4.624258 -3.62957 1.252239
H  1.16224 -2.609615 2.226445
H  1.044005 -2.437297 0.489643
H  1.210275 -1.004818 1.503168
H  -2.837018 -2.345954 1.439341
H  -3.712224 -1.07488 2.25915
H  -5.347603 -0.621282 -1.750074
H  -4.134991 -1.540794 -2.608319
H  -5.170232 -2.980274 1.315461
H  -5.670088 -1.359261 0.875866
H  -5.703699 -2.916182 -1.086254
H  -3.98887 -3.209976 -0.878577
elementType: O N C H
totalener: -1094.86811396 hartree
nucrepener: 2121.32824657 hartree
electener: -3216.19636053 hartree
oneelecener: -5705.11083990 hartree
twoeener: 2488.91447937 hartree
cpcmener: -0.03872970 hartree
kineticenergy: 1090.04779904 hartree
xcener: -105.975449899414 hartree
chargesum: -0.0000000
charge: -0.288241 -0.485162 -0.440048 -0.434006 -0.094852 0.148455 -0.003205 -0.117720 -0.282554 -0.283326 -0.311993 0.409922 -0.007846 0.079700 -0.230509 -0.234221 -0.049836 -0.080566 -0.075385 -0.068379 -0.132879 -0.137505 0.330629 0.342146 0.104128 0.097567 0.101072 0.095752 0.092319 0.099328 0.098775 0.093695 0.124696 0.127297 0.140599 0.095446 0.097442 0.089960 0.102891 0.103958 0.071049 0.102658 0.094242 0.101714 0.093542 0.081337 0.078069 0.081239 0.078606
qa: -0.2882 -0.4852 -0.4400 -0.4340 -0.0949 0.1485 -0.0032 -0.1177 -0.2826 -0.2833 -0.3120 0.4099 -0.0078 0.0797 -0.2305 -0.2342 -0.0498 -0.0806 -0.0754 -0.0684 -0.1329 -0.1375 0.3306 0.3421 0.1041 0.0976 0.1011 0.0958 0.0923 0.0993 0.0988 0.0937 0.1247 0.1273 0.1406 0.0954 0.0974 0.0900 0.1029 0.1040 0.0710 0.1027 0.0942 0.1017 0.0935 0.0813 0.0781 0.0812 0.0786
va: 2.1049 2.0143 2.0634 2.0778 3.1082 3.6937 3.7973 3.8080 3.8957 3.9080 3.8948 4.1353 3.7142 3.8665 3.9312 3.9392 3.6800 3.7126 3.9212 3.9159 3.9141 3.9197 4.1764 4.1955 1.0265 1.0305 0.9988 1.0008 1.0172 1.0002 1.0028 1.0021 1.0035 1.0155 1.0150 0.9960 0.9961 1.0061 1.0014 0.9973 1.0123 1.0048 1.0153 1.0044 1.0155 1.0093 1.0068 1.0091 1.0065
dispcorr: -0.024195666 hartree
energy: -1094.892309624907
dipole: 14.90639 -15.84282 -0.93644 -17.31371 15.37279 -1.94092 4.49524 -5.03381 -0.53858
magnitude: 2.22130 au
magnitude: 5.64609 debye
