program: Orca
programVersion: 5.0.2
elementType: O O O O N C C C C C C C C C C C C C C C C C C C H H H H H H H H H H H H H H H H H H H H H H H H H
charge: 0
multiplicity: 1
keywords: wb97x-d3
keywords: def2-TZVPP
keywords: def2/J RIJCOSX
keywords: DEFGRID2
keywords: scfconv7
keywords: smallprint printgap noloewdin
keywords: NOSOSCF
formula: C19H25NO4
InChI: InChI=1/C19H25NO4/c1-11(2)9-14-15(19(14,3)4)18(23)24-10-20-16(21)12-7-5-6-8-13(12)17(20)22/h9,14-15H,5-8,10H2,1-4H3
49 atoms
O  0.517592 1.3203 -0.539617
O  1.745594 3.103159 -1.064889
O  -2.469015 0.685425 -2.351986
O  -1.537695 1.304886 2.051671
N  -1.76228 1.297615 -0.242631
C  3.22814 0.51061 0.823996
C  2.83537 -0.398296 -0.303894
C  2.868674 1.091139 -0.536855
C  2.291419 0.654051 1.997639
C  4.682389 0.606152 1.212061
C  3.828334 -1.256671 -0.997296
C  1.679126 1.936306 -0.743398
C  3.98791 -2.565537 -0.783075
C  -0.661143 2.127677 -0.580263
C  5.006303 -3.360215 -1.541998
C  3.183294 -3.348344 0.208626
C  -3.488282 -0.224701 -0.352881
C  -3.213835 -0.044381 0.940145
C  -4.550019 -1.113636 -0.883363
C  -3.931664 -0.692337 2.063804
C  -5.036618 -2.045282 0.228057
C  -5.236091 -1.303277 1.548532
C  -2.55347 0.6027 -1.152804
C  -2.08756 0.911852 1.053073
H  1.844728 -0.829083 -0.198216
H  3.721566 1.468356 -1.0918
H  2.35915 1.650972 2.437703
H  2.569045 -0.063569 2.772115
H  1.250215 0.465849 1.745211
H  4.95295 -0.217146 1.876467
H  4.876483 1.538358 1.745637
H  5.350337 0.570963 0.352165
H  4.470586 -0.771332 -1.726671
H  -0.815665 2.538664 -1.57685
H  -0.586356 2.946269 0.134864
H  5.550833 -2.750898 -2.262993
H  4.535902 -4.184775 -2.08387
H  5.733372 -3.813547 -0.863335
H  2.536772 -2.727586 0.826695
H  3.841655 -3.909109 0.876427
H  2.556367 -4.088181 -0.296154
H  -5.373367 -0.501119 -1.263982
H  -4.178703 -1.684202 -1.737552
H  -3.289842 -1.462041 2.503868
H  -4.125068 0.030751 2.859178
H  -5.968628 -2.521401 -0.077936
H  -4.306157 -2.846619 0.369592
H  -5.642515 -1.980477 2.30051
H  -5.974448 -0.508906 1.409427
elementType: O N C H
totalener: -1094.86853690 hartree
nucrepener: 2091.49537726 hartree
electener: -3186.36391415 hartree
oneelecener: -5644.64351911 hartree
twoeener: 2458.27960495 hartree
cpcmener: -0.03801499 hartree
kineticenergy: 1090.03573138 hartree
xcener: -105.971675686448 hartree
chargesum: -0.0000000
charge: -0.270380 -0.494867 -0.432052 -0.436424 -0.106617 0.147110 0.031941 -0.143109 -0.287585 -0.272425 -0.296484 0.431943 -0.026755 0.068983 -0.229644 -0.255036 -0.076731 -0.050023 -0.069847 -0.075663 -0.137699 -0.133141 0.339541 0.328284 0.105431 0.095847 0.105454 0.097180 0.078404 0.096275 0.099717 0.092508 0.124087 0.132355 0.140861 0.089584 0.094162 0.095307 0.087827 0.095290 0.101766 0.102283 0.093584 0.103707 0.094730 0.081558 0.079402 0.080875 0.078483
qa: -0.2704 -0.4949 -0.4321 -0.4364 -0.1066 0.1471 0.0319 -0.1431 -0.2876 -0.2724 -0.2965 0.4319 -0.0268 0.0690 -0.2296 -0.2550 -0.0767 -0.0500 -0.0698 -0.0757 -0.1377 -0.1331 0.3395 0.3283 0.1054 0.0958 0.1055 0.0972 0.0784 0.0963 0.0997 0.0925 0.1241 0.1324 0.1409 0.0896 0.0942 0.0953 0.0878 0.0953 0.1018 0.1023 0.0936 0.1037 0.0947 0.0816 0.0794 0.0809 0.0785
va: 2.1076 2.0007 2.0794 2.0682 3.1388 3.6643 3.7514 3.9380 3.9159 3.9089 3.8633 4.1264 3.7000 3.8904 3.9271 3.9439 3.7052 3.6935 3.9170 3.9195 3.9188 3.9154 4.1822 4.1733 1.0139 1.0336 0.9997 1.0026 1.0132 1.0023 1.0024 1.0023 1.0074 1.0064 0.9991 1.0077 0.9950 0.9963 1.0072 0.9982 0.9972 1.0043 1.0154 1.0043 1.0148 1.0092 1.0064 1.0096 1.0068
dispcorr: -0.023448550 hartree
energy: -1094.891985445831
dipole: 15.05194 -16.39661 -1.34467 -22.22175 19.82960 -2.39216 8.32528 -7.20994 1.11534
magnitude: 2.96219 au
magnitude: 7.52928 debye
