program: Orca
programVersion: 5.0.2
elementType: O O O O N C C C C C C C C C C C C C C C C C C C H H H H H H H H H H H H H H H H H H H H H H H H H
charge: 0
multiplicity: 1
keywords: wb97x-d3
keywords: def2-TZVPP
keywords: def2/J RIJCOSX
keywords: DEFGRID2
keywords: scfconv7
keywords: smallprint printgap noloewdin
keywords: NOSOSCF
formula: C19H25NO4
InChI: InChI=1/C19H25NO4/c1-11(2)9-14-15(19(14,3)4)18(23)24-10-20-16(21)12-7-5-6-8-13(12)17(20)22/h9,14-15H,5-8,10H2,1-4H3
49 atoms
O  0.616447 1.088565 -1.175759
O  1.69186 3.001373 -0.727629
O  -2.241431 -0.518748 -2.303804
O  -1.480549 2.439342 1.054544
N  -1.678111 1.212694 -0.886321
C  2.490957 0.117277 1.150406
C  2.772933 -0.543566 -0.167687
C  2.705841 0.967136 -0.092155
C  1.110606 -0.03523 1.742697
C  3.573257 0.199577 2.198559
C  4.070851 -1.178777 -0.475414
C  1.636895 1.793559 -0.681401
C  4.258805 -2.395862 -0.996798
C  -0.570233 1.75543 -1.597638
C  5.642043 -2.906488 -1.269825
C  3.165426 -3.356825 -1.349833
C  -3.224208 -0.306742 -0.103287
C  -3.001432 0.560284 0.886075
C  -4.176329 -1.441484 -0.047262
C  -3.681153 0.541191 2.203877
C  -4.60634 -1.676432 1.401747
C  -4.909669 -0.36658 2.127062
C  -2.356651 0.053021 -1.249095
C  -1.978748 1.53321 0.434202
H  1.904942 -1.018735 -0.609749
H  3.659489 1.484117 -0.107632
H  0.81383 0.862254 2.288478
H  1.111876 -0.863163 2.454292
H  0.34603 -0.254891 0.999883
H  3.634776 -0.736418 2.757448
H  3.350614 0.995013 2.912013
H  4.557275 0.401788 1.778043
H  4.953832 -0.584674 -0.257616
H  -0.702797 1.575169 -2.661727
H  -0.514183 2.827506 -1.426309
H  6.41011 -2.181267 -1.002723
H  5.764933 -3.155199 -2.327051
H  5.838015 -3.826632 -0.713599
H  2.16515 -2.983105 -1.146789
H  3.287527 -4.289263 -0.794459
H  3.213488 -3.62345 -2.407513
H  -5.041816 -1.215222 -0.677735
H  -3.721839 -2.339798 -0.47087
H  -2.980261 0.181852 2.964018
H  -3.959868 1.553495 2.504237
H  -5.481746 -2.326358 1.420213
H  -3.810048 -2.206723 1.931032
H  -5.275048 -0.571746 3.133798
H  -5.711795 0.16021 1.602885
elementType: O N C H
totalener: -1094.86865537 hartree
nucrepener: 2127.90987004 hartree
electener: -3222.77852541 hartree
oneelecener: -5717.46111232 hartree
twoeener: 2494.68258691 hartree
cpcmener: -0.04047989 hartree
kineticenergy: 1090.04303384 hartree
xcener: -105.975043690389 hartree
chargesum: 0.0000000
charge: -0.273843 -0.482907 -0.433565 -0.428427 -0.089474 0.109521 0.077976 -0.133605 -0.276467 -0.273027 -0.303727 0.431600 -0.048941 0.072081 -0.220469 -0.251552 -0.075300 -0.009531 -0.067801 -0.071041 -0.137593 -0.133391 0.346666 0.256854 0.101363 0.093560 0.101751 0.101187 0.077474 0.096843 0.098454 0.089180 0.122104 0.129518 0.135522 0.088670 0.093683 0.093634 0.088531 0.096471 0.096431 0.101163 0.093494 0.102319 0.094921 0.081101 0.078925 0.081282 0.078385
qa: -0.2738 -0.4829 -0.4336 -0.4284 -0.0895 0.1095 0.0780 -0.1336 -0.2765 -0.2730 -0.3037 0.4316 -0.0489 0.0721 -0.2205 -0.2516 -0.0753 -0.0095 -0.0678 -0.0710 -0.1376 -0.1334 0.3467 0.2569 0.1014 0.0936 0.1018 0.1012 0.0775 0.0968 0.0985 0.0892 0.1221 0.1295 0.1355 0.0887 0.0937 0.0936 0.0885 0.0965 0.0964 0.1012 0.0935 0.1023 0.0949 0.0811 0.0789 0.0813 0.0784
va: 2.1086 2.0188 2.0753 2.0703 3.1093 3.6946 3.7175 3.8470 3.9092 3.9080 3.8543 4.1547 3.7650 3.8768 3.9216 3.9425 3.7166 3.6003 3.9161 3.9163 3.9191 3.9154 4.1735 4.2069 1.0212 1.0330 1.0048 1.0022 1.0121 1.0018 1.0012 1.0061 1.0103 1.0082 1.0223 1.0088 0.9961 0.9963 1.0111 0.9971 0.9969 1.0046 1.0157 1.0052 1.0154 1.0092 1.0068 1.0094 1.0066
dispcorr: -0.024490407 hartree
energy: -1094.893145777676
dipole: 12.72212 -14.09172 -1.36959 -21.41742 19.15245 -2.26497 11.42539 -10.30828 1.11711
magnitude: 2.87294 au
magnitude: 7.30245 debye
