program: Orca
programVersion: 5.0.2
elementType: O O O O N C C C C C C C C C C C C C C C C C C C H H H H H H H H H H H H H H H H H H H H H H H H H
charge: 0
multiplicity: 1
keywords: wb97x-d3
keywords: def2-TZVPP
keywords: def2/J RIJCOSX
keywords: DEFGRID2
keywords: scfconv7
keywords: smallprint printgap noloewdin
keywords: NOSOSCF
formula: C19H25NO4
InChI: InChI=1/C19H25NO4/c1-11(2)9-14-15(19(14,3)4)18(23)24-10-20-16(21)12-7-5-6-8-13(12)17(20)22/h9,14-15H,5-8,10H2,1-4H3
49 atoms
O  0.243177 1.070264 -0.623555
O  1.48562 2.057572 0.95911
O  -1.789474 0.098909 1.688338
O  -2.907575 1.614723 -2.445331
N  -2.055371 1.115399 -0.359012
C  3.78731 0.543689 -0.588407
C  3.47454 -0.149501 0.699505
C  2.346793 0.178136 -0.249183
C  4.257811 1.97548 -0.546771
C  4.40944 -0.255808 -1.705931
C  3.833803 -1.570261 0.942916
C  1.353104 1.19988 0.117265
C  4.97767 -1.970235 1.504232
C  -0.873388 1.909043 -0.347404
C  5.268246 -3.420397 1.74067
C  6.052953 -1.024361 1.943016
C  -3.689723 -0.383921 0.263126
C  -4.015757 0.063736 -0.950321
C  -4.490019 -1.341824 1.06384
C  -5.226265 -0.333003 -1.709254
C  -5.895815 -1.446433 0.470492
C  -5.864904 -1.559054 -1.053159
C  -2.417967 0.257203 0.671465
C  -2.972444 1.020004 -1.398804
H  3.525671 0.497853 1.570857
H  1.946204 -0.648863 -0.825424
H  5.347742 1.995962 -0.48738
H  3.878255 2.527971 0.309523
H  3.969901 2.512548 -1.452423
H  4.22925 0.224795 -2.669061
H  4.019092 -1.271286 -1.762125
H  5.490468 -0.323982 -1.566708
H  3.111106 -2.322943 0.641461
H  -0.948254 2.670204 -1.121775
H  -0.770948 2.399409 0.618163
H  5.44636 -3.616238 2.801214
H  6.17561 -3.727805 1.214719
H  4.452166 -4.063212 1.411465
H  5.848155 0.012562 1.681206
H  7.010691 -1.298521 1.494093
H  6.196281 -1.075548 3.025612
H  -3.994445 -2.317639 1.062307
H  -4.528599 -1.024283 2.108166
H  -5.928303 0.506575 -1.726703
H  -4.972957 -0.535814 -2.752241
H  -6.408537 -2.30872 0.897952
H  -6.472864 -0.563204 0.757698
H  -6.876776 -1.690611 -1.437794
H  -5.302948 -2.452783 -1.337513
elementType: O N C H
totalener: -1094.86872293 hartree
nucrepener: 2040.23400205 hartree
electener: -3135.10272498 hartree
oneelecener: -5542.75997211 hartree
twoeener: 2407.65724712 hartree
cpcmener: -0.03747938 hartree
kineticenergy: 1090.03874118 hartree
xcener: -105.972954681075 hartree
chargesum: -0.0000000
charge: -0.284957 -0.488358 -0.438068 -0.434778 -0.095680 0.123829 -0.011865 -0.129088 -0.294924 -0.272434 -0.251225 0.439938 -0.044319 0.077201 -0.228259 -0.248877 -0.058120 -0.082715 -0.074055 -0.070331 -0.133842 -0.136669 0.339688 0.342162 0.099986 0.097860 0.097306 0.094307 0.103688 0.101358 0.093655 0.097520 0.123424 0.129255 0.139888 0.094968 0.094923 0.090133 0.086796 0.096191 0.103547 0.102668 0.092744 0.101950 0.094329 0.081104 0.078421 0.081270 0.078456
qa: -0.2850 -0.4884 -0.4381 -0.4348 -0.0957 0.1238 -0.0119 -0.1291 -0.2949 -0.2724 -0.2512 0.4399 -0.0443 0.0772 -0.2283 -0.2489 -0.0581 -0.0827 -0.0741 -0.0703 -0.1338 -0.1367 0.3397 0.3422 0.1000 0.0979 0.0973 0.0943 0.1037 0.1014 0.0937 0.0975 0.1234 0.1293 0.1399 0.0950 0.0949 0.0901 0.0868 0.0962 0.1035 0.1027 0.0927 0.1020 0.0943 0.0811 0.0784 0.0813 0.0785
va: 2.1063 2.0175 2.0720 2.0766 3.1109 3.6794 3.7976 3.8592 3.8994 3.9076 3.8539 4.1481 3.7086 3.8487 3.9269 3.9367 3.6791 3.7171 3.9224 3.9179 3.9148 3.9189 4.1901 4.1972 1.0250 1.0348 1.0003 1.0173 0.9997 1.0032 1.0021 1.0006 1.0062 1.0111 1.0159 0.9951 0.9964 1.0072 1.0077 0.9980 0.9985 1.0044 1.0154 1.0045 1.0150 1.0095 1.0068 1.0093 1.0064
dispcorr: -0.022456650 hartree
energy: -1094.891179582619
dipole: 22.86241 -23.85967 -0.99726 -14.92552 13.36596 -1.55955 2.21575 -2.82720 -0.61145
magnitude: 1.94951 au
magnitude: 4.95527 debye
