program: Orca
programVersion: 5.0.2
elementType: O O O O N C C C C C C C C C C C C C C C C C C C H H H H H H H H H H H H H H H H H H H H H H H H H
charge: 0
multiplicity: 1
keywords: wb97x-d3
keywords: def2-TZVPP
keywords: def2/J RIJCOSX
keywords: DEFGRID2
keywords: scfconv7
keywords: smallprint printgap noloewdin
keywords: NOSOSCF
formula: C19H25NO4
InChI: InChI=1/C19H25NO4/c1-11(2)9-14-15(19(14,3)4)18(23)24-10-20-16(21)12-7-5-6-8-13(12)17(20)22/h9,14-15H,5-8,10H2,1-4H3
49 atoms
O  0.594265 1.88583 -1.204126
O  0.265339 -0.292794 -1.590859
O  -2.693574 0.142916 -2.313512
O  -1.157581 2.655691 1.15022
N  -1.7287 1.638783 -0.838474
C  2.339678 -0.127325 0.895972
C  2.846441 -0.925887 -0.275134
C  2.271039 0.446707 -0.509011
C  1.075144 -0.58175 1.583516
C  3.32457 0.523344 1.834797
C  4.283758 -1.162544 -0.518152
C  0.960956 0.598152 -1.165793
C  4.826746 -2.360591 -0.753081
C  -0.710588 2.205466 -1.668525
C  6.292221 -2.508728 -1.023159
C  4.019065 -3.631648 -0.781019
C  -3.237324 0.133517 0.042056
C  -2.796887 0.87702 1.057788
C  -4.236814 -0.955949 0.152725
C  -3.242712 0.750333 2.466202
C  -4.413667 -1.334536 1.624456
C  -4.510649 -0.103812 2.524712
C  -2.557189 0.578111 -1.198301
C  -1.801858 1.842368 0.534677
H  2.192474 -1.74217 -0.565054
H  2.969187 1.254493 -0.703545
H  1.322756 -1.26886 2.394599
H  0.386731 -1.101973 0.91899
H  0.544645 0.265509 2.023915
H  4.205356 0.907371 1.32224
H  3.662548 -0.191216 2.587833
H  2.857694 1.359053 2.359223
H  4.932123 -0.291264 -0.517465
H  -0.867986 1.873273 -2.694031
H  -0.756557 3.290677 -1.642473
H  6.465831 -2.973969 -1.997084
H  6.763268 -3.161638 -0.283888
H  6.812532 -1.551145 -1.009856
H  4.665938 -4.50807 -0.812484
H  3.373266 -3.681123 -1.660864
H  3.375855 -3.733237 0.093921
H  -5.185215 -0.621059 -0.278992
H  -3.924663 -1.820083 -0.438044
H  -2.440226 0.296045 3.056088
H  -3.415592 1.736928 2.901564
H  -5.305759 -1.951261 1.737584
H  -3.565519 -1.94774 1.940746
H  -4.698005 -0.40803 3.554909
H  -5.366012 0.503092 2.215982
elementType: O N C H
totalener: -1094.86752736 hartree
nucrepener: 2146.39916885 hartree
electener: -3241.26669621 hartree
oneelecener: -5755.38993784 hartree
twoeener: 2514.12324163 hartree
cpcmener: -0.03981462 hartree
kineticenergy: 1090.04534866 hartree
xcener: -105.974845516798 hartree
chargesum: -0.0000000
charge: -0.276626 -0.472872 -0.427849 -0.433799 -0.103443 0.130164 0.033615 -0.120749 -0.279385 -0.273705 -0.314107 0.402610 -0.013760 0.084217 -0.220898 -0.283177 -0.023548 -0.096092 -0.075467 -0.066785 -0.134236 -0.138472 0.313093 0.322924 0.093766 0.100768 0.106107 0.090226 0.090769 0.089893 0.098153 0.098180 0.122448 0.135626 0.146103 0.098381 0.095564 0.085670 0.096180 0.104222 0.102455 0.101677 0.093673 0.102799 0.095371 0.080937 0.078932 0.081085 0.079361
qa: -0.2766 -0.4729 -0.4278 -0.4338 -0.1034 0.1302 0.0336 -0.1207 -0.2794 -0.2737 -0.3141 0.4026 -0.0138 0.0842 -0.2209 -0.2832 -0.0235 -0.0961 -0.0755 -0.0668 -0.1342 -0.1385 0.3131 0.3229 0.0938 0.1008 0.1061 0.0902 0.0908 0.0899 0.0982 0.0982 0.1224 0.1356 0.1461 0.0984 0.0956 0.0857 0.0962 0.1042 0.1025 0.1017 0.0937 0.1028 0.0954 0.0809 0.0789 0.0811 0.0794
va: 2.1140 2.0314 2.0803 2.0662 3.0805 3.6884 3.7885 3.8346 3.9022 3.9040 3.8868 4.2067 3.6956 3.8879 3.9211 3.9407 3.6219 3.7157 3.9120 3.9127 3.9152 3.9208 4.1919 4.1585 1.0268 1.0320 1.0015 1.0137 1.0093 1.0048 1.0015 1.0024 1.0082 1.0139 0.9925 0.9926 0.9936 1.0098 1.0041 0.9960 0.9960 1.0039 1.0158 1.0059 1.0158 1.0092 1.0072 1.0093 1.0059
dispcorr: -0.025136866 hartree
energy: -1094.892664224890
dipole: 17.49805 -17.83851 -0.34046 -18.52092 18.22215 -0.29878 13.72163 -12.15527 1.56636
magnitude: 1.63054 au
magnitude: 4.14451 debye
