program: Orca
programVersion: 5.0.2
elementType: O O O O N C C C C C C C C C C C C C C C C C C C H H H H H H H H H H H H H H H H H H H H H H H H H
charge: 0
multiplicity: 1
keywords: wb97x-d3
keywords: def2-TZVPP
keywords: def2/J RIJCOSX
keywords: DEFGRID2
keywords: scfconv7
keywords: smallprint printgap noloewdin
keywords: NOSOSCF
formula: C19H25NO4
InChI: InChI=1/C19H25NO4/c1-11(2)9-14-15(19(14,3)4)18(23)24-10-20-16(21)12-7-5-6-8-13(12)17(20)22/h9,14-15H,5-8,10H2,1-4H3
49 atoms
O  0.224499 1.352015 0.14377
O  1.56547 1.063279 1.918245
O  -3.002508 2.655326 -0.835062
O  -1.591753 -0.901419 1.609417
N  -2.038323 1.10823 0.57902
C  3.738327 1.073405 -0.378832
C  3.544066 -0.305892 0.173484
C  2.335759 0.491088 -0.273621
C  4.186073 2.168502 0.557038
C  4.276952 1.236018 -1.778984
C  3.915878 -1.527324 -0.572505
C  1.374225 0.981085 0.727823
C  4.752425 -2.470655 -0.129577
C  -0.854553 1.802508 0.95698
C  5.035263 -3.698533 -0.939882
C  5.444585 -2.406786 1.202064
C  -3.952614 0.449239 -0.518209
C  -3.543831 -0.5945 0.205695
C  -5.164566 0.472059 -1.373053
C  -4.241666 -1.900153 0.291859
C  -5.674225 -0.956799 -1.571561
C  -5.65733 -1.756211 -0.269007
C  -2.99006 1.562094 -0.327231
C  -2.289557 -0.22003 0.900134
H  3.657812 -0.368074 1.250912
H  1.892804 0.206342 -1.221679
H  5.275182 2.238775 0.538903
H  3.891374 1.999966 1.590369
H  3.790305 3.137065 0.245366
H  5.366694 1.167769 -1.774382
H  4.009042 2.214507 -2.18129
H  3.900268 0.481428 -2.468153
H  3.457846 -1.661574 -1.548082
H  -0.998234 2.867751 0.788079
H  -0.653456 1.638641 2.012895
H  6.09707 -3.767736 -1.189585
H  4.466398 -3.720722 -1.869088
H  4.794016 -4.602691 -0.374401
H  5.625578 -1.387586 1.541201
H  6.409007 -2.915465 1.161829
H  4.857874 -2.910514 1.97524
H  -5.929153 1.09369 -0.896662
H  -4.945148 0.946376 -2.332195
H  -3.675645 -2.648356 -0.27211
H  -4.262848 -2.253297 1.325172
H  -6.68419 -0.929434 -1.981777
H  -5.047308 -1.461039 -2.312133
H  -6.088525 -2.744771 -0.42988
H  -6.28721 -1.255325 0.471318
elementType: O N C H
totalener: -1094.86936778 hartree
nucrepener: 2046.33398475 hartree
electener: -3141.20335252 hartree
oneelecener: -5555.03117763 hartree
twoeener: 2413.82782510 hartree
cpcmener: -0.03825842 hartree
kineticenergy: 1090.03085957 hartree
xcener: -105.971727980080 hartree
chargesum: -0.0000000
charge: -0.284222 -0.486193 -0.434423 -0.437222 -0.102777 0.124621 0.050616 -0.157825 -0.282859 -0.265199 -0.310565 0.442527 -0.012940 0.081561 -0.221641 -0.279331 -0.080934 -0.055163 -0.070620 -0.074171 -0.135555 -0.135152 0.342508 0.337390 0.093618 0.095501 0.097285 0.092006 0.100902 0.097432 0.098999 0.090035 0.123255 0.128993 0.138960 0.093934 0.087637 0.096834 0.097512 0.095528 0.106871 0.102031 0.093894 0.102912 0.093699 0.080654 0.078742 0.081322 0.079013
qa: -0.2842 -0.4862 -0.4344 -0.4372 -0.1028 0.1246 0.0506 -0.1578 -0.2829 -0.2652 -0.3106 0.4425 -0.0129 0.0816 -0.2216 -0.2793 -0.0809 -0.0552 -0.0706 -0.0742 -0.1356 -0.1352 0.3425 0.3374 0.0936 0.0955 0.0973 0.0920 0.1009 0.0974 0.0990 0.0900 0.1233 0.1290 0.1390 0.0939 0.0876 0.0968 0.0975 0.0955 0.1069 0.1020 0.0939 0.1029 0.0937 0.0807 0.0787 0.0813 0.0790
va: 2.1077 2.0211 2.0767 2.0733 3.1155 3.6851 3.7439 3.8793 3.9082 3.9078 3.8962 4.1402 3.7015 3.8499 3.9259 3.9452 3.7125 3.6693 3.9173 3.9201 3.9174 3.9146 4.1980 4.1965 1.0291 1.0372 1.0004 1.0173 0.9993 1.0022 1.0024 1.0042 1.0083 1.0111 1.0188 0.9955 1.0092 0.9935 1.0001 1.0005 0.9941 1.0046 1.0154 1.0046 1.0150 1.0095 1.0065 1.0095 1.0067
dispcorr: -0.021911615 hartree
energy: -1094.891279391395
dipole: 21.41053 -22.51611 -1.10558 -13.67614 12.75761 -0.91852 -7.98355 6.61418 -1.36937
magnitude: 1.98524 au
magnitude: 5.04608 debye
