program: Orca
programVersion: 5.0.2
elementType: O O O O N C C C C C C C C C C C C C C C C C C C H H H H H H H H H H H H H H H H H H H H H H H H H
charge: 0
multiplicity: 1
keywords: wb97x-d3
keywords: def2-TZVPP
keywords: def2/J RIJCOSX
keywords: DEFGRID2
keywords: scfconv7
keywords: smallprint printgap noloewdin
keywords: NOSOSCF
formula: C19H25NO4
InChI: InChI=1/C19H25NO4/c1-11(2)9-14-15(19(14,3)4)18(23)24-10-20-16(21)12-7-5-6-8-13(12)17(20)22/h9,14-15H,5-8,10H2,1-4H3
49 atoms
O  0.245137 1.448414 0.150219
O  1.532496 1.043561 1.943599
O  -2.961985 2.639403 -0.933459
O  -1.550425 -0.76354 1.719739
N  -2.016224 1.189856 0.592916
C  3.703134 1.072828 -0.393965
C  3.529753 -0.295488 0.194078
C  2.308367 0.481634 -0.250135
C  4.151561 2.189898 0.515332
C  4.210672 1.221233 -1.807122
C  3.891643 -1.531503 -0.529583
C  1.358576 0.999801 0.748748
C  4.611627 -2.54963 -0.046154
C  -0.841656 1.914637 0.943072
C  4.880666 -3.764114 -0.883564
C  5.198536 -2.603875 1.331734
C  -3.882151 0.435582 -0.5271
C  -3.469197 -0.565146 0.252605
C  -5.077877 0.396605 -1.403421
C  -4.121832 -1.891867 0.356966
C  -5.944527 -0.807937 -1.031467
C  -5.108407 -2.065693 -0.799303
C  -2.9459 1.575254 -0.367173
C  -2.246306 -0.129105 0.96631
H  3.664334 -0.327287 1.269881
H  1.851892 0.175684 -1.185178
H  5.239688 2.27052 0.485307
H  3.867965 2.038612 1.554891
H  3.742938 3.148256 0.188985
H  3.818938 0.460717 -2.480976
H  5.300333 1.156821 -1.82843
H  3.929374 2.195057 -2.211887
H  3.520125 -1.615602 -1.546808
H  -0.996919 2.969119 0.726138
H  -0.640401 1.801444 2.005548
H  4.511183 -4.667367 -0.390865
H  5.953964 -3.910751 -1.02909
H  4.412186 -3.70063 -1.865457
H  5.123631 -1.667167 1.880603
H  6.256115 -2.874558 1.284212
H  4.710881 -3.37967 1.928581
H  -5.643591 1.326835 -1.315661
H  -4.756262 0.335664 -2.447845
H  -3.371058 -2.685384 0.35389
H  -4.635448 -1.965892 1.320579
H  -6.508565 -0.577543 -0.123392
H  -6.677819 -0.985803 -1.818667
H  -4.554206 -2.305148 -1.710977
H  -5.760307 -2.915999 -0.596678
elementType: O N C H
totalener: -1094.87015065 hartree
nucrepener: 2052.59867125 hartree
electener: -3147.46882190 hartree
oneelecener: -5567.57425692 hartree
twoeener: 2420.10543502 hartree
cpcmener: -0.03921016 hartree
kineticenergy: 1090.03208039 hartree
xcener: -105.972368234344 hartree
chargesum: 0.0000000
charge: -0.281706 -0.484089 -0.434454 -0.436242 -0.106527 0.105649 0.050080 -0.137338 -0.274055 -0.268823 -0.290768 0.438860 -0.041981 0.082873 -0.219664 -0.257670 -0.080348 -0.053207 -0.073168 -0.071830 -0.135775 -0.135009 0.345359 0.334736 0.089075 0.096209 0.098109 0.091338 0.100408 0.090238 0.098006 0.098347 0.122237 0.128355 0.138108 0.093518 0.094231 0.088877 0.091817 0.094074 0.100247 0.094299 0.102899 0.093438 0.101796 0.078437 0.081236 0.078616 0.081180
qa: -0.2817 -0.4841 -0.4345 -0.4362 -0.1065 0.1056 0.0501 -0.1373 -0.2741 -0.2688 -0.2908 0.4389 -0.0420 0.0829 -0.2197 -0.2577 -0.0803 -0.0532 -0.0732 -0.0718 -0.1358 -0.1350 0.3454 0.3347 0.0891 0.0962 0.0981 0.0913 0.1004 0.0902 0.0980 0.0983 0.1222 0.1284 0.1381 0.0935 0.0942 0.0889 0.0918 0.0941 0.1002 0.0943 0.1029 0.0934 0.1018 0.0784 0.0812 0.0786 0.0812
va: 2.1083 2.0257 2.0768 2.0750 3.1150 3.7051 3.7572 3.8276 3.9081 3.9074 3.8795 4.1582 3.7500 3.8560 3.9216 3.9430 3.7072 3.6674 3.9188 3.9176 3.9160 3.9156 4.1976 4.1964 1.0348 1.0361 1.0002 1.0164 0.9996 1.0052 1.0017 1.0020 1.0097 1.0114 1.0203 0.9953 0.9966 1.0087 1.0081 0.9978 0.9957 1.0152 1.0047 1.0158 1.0044 1.0065 1.0093 1.0067 1.0094
dispcorr: -0.021896953 hartree
energy: -1094.892047602014
dipole: 20.84922 -21.95007 -1.10084 -14.63373 13.69348 -0.94025 -8.03245 6.63095 -1.40150
magnitude: 2.01497 au
magnitude: 5.12166 debye
