program: Orca
programVersion: 5.0.2
elementType: O O O O N C C C C C C C C C C C C C C C C C C C H H H H H H H H H H H H H H H H H H H H H H H H H
charge: 0
multiplicity: 1
keywords: wb97x-d3
keywords: def2-TZVPP
keywords: def2/J RIJCOSX
keywords: DEFGRID2
keywords: scfconv7
keywords: smallprint printgap noloewdin
keywords: NOSOSCF
formula: C19H25NO4
InChI: InChI=1/C19H25NO4/c1-11(2)9-14-15(19(14,3)4)18(23)24-10-20-16(21)12-7-5-6-8-13(12)17(20)22/h9,14-15H,5-8,10H2,1-4H3
49 atoms
O  0.192969 0.681472 0.435694
O  1.747228 1.010813 2.000053
O  -2.660357 2.593124 -0.192308
O  -2.080095 -1.636101 1.359893
N  -2.070352 0.60052 0.806897
C  3.64753 1.182826 -0.494352
C  3.768739 -0.173162 0.131907
C  2.394128 0.369453 -0.216637
C  3.974989 2.395938 0.341673
C  4.008363 1.358584 -1.949553
C  4.271041 -1.355694 -0.597094
C  1.456475 0.720684 0.863461
C  5.217669 -2.187265 -0.152448
C  -0.829853 0.9681 1.389832
C  5.627651 -3.388529 -0.948044
C  5.918816 -2.002948 1.166719
C  -3.99289 0.588849 -0.459508
C  -3.828575 -0.651437 0.003887
C  -5.114827 1.034847 -1.321526
C  -4.750866 -1.786221 -0.246634
C  -5.845082 -0.189426 -1.876563
C  -6.072222 -1.250893 -0.800386
C  -2.868488 1.42793 0.02489
C  -2.581066 -0.693216 0.804906
H  3.995516 -0.150902 1.193181
H  1.923796 -0.055029 -1.097014
H  5.018723 2.675967 0.184733
H  3.841085 2.233696 1.408625
H  3.360743 3.250672 0.049821
H  3.684537 0.525609 -2.572523
H  5.090116 1.456901 -2.063786
H  3.550814 2.265073 -2.35059
H  3.813542 -1.565081 -1.559705
H  -0.840764 2.031377 1.628946
H  -0.677939 0.399715 2.306774
H  5.057682 -3.486761 -1.872073
H  5.489591 -4.306281 -0.369152
H  6.689007 -3.346944 -1.207704
H  6.232981 -0.971637 1.332481
H  6.81079 -2.627007 1.228954
H  5.278313 -2.283016 2.007154
H  -5.795717 1.658785 -0.733294
H  -4.745043 1.671596 -2.128763
H  -4.285901 -2.479538 -0.955313
H  -4.911622 -2.357315 0.670881
H  -6.797718 0.117647 -2.310447
H  -5.254752 -0.620778 -2.690344
H  -6.66288 -2.07562 -1.201695
H  -6.655325 -0.817918 0.017754
elementType: O N C H
totalener: -1094.88047305 hartree
nucrepener: 2029.61725334 hartree
electener: -3124.49772640 hartree
oneelecener: -5521.30758251 hartree
twoeener: 2396.80985612 hartree
cpcmener: -0.03028913 hartree
kineticenergy: 1090.03406787 hartree
xcener: -105.968174724753 hartree
chargesum: -0.0000000
charge: -0.275816 -0.472267 -0.407569 -0.407211 -0.114039 0.109467 0.055583 -0.107083 -0.281035 -0.265168 -0.304065 0.401173 -0.010335 0.091643 -0.220862 -0.285429 -0.073600 -0.071661 -0.072386 -0.071081 -0.134142 -0.136860 0.317466 0.319769 0.094217 0.087086 0.094777 0.093832 0.099257 0.087649 0.096685 0.097054 0.116764 0.135291 0.126297 0.084735 0.097967 0.094450 0.101556 0.094752 0.106384 0.099603 0.094049 0.101339 0.093220 0.080805 0.077748 0.081935 0.078056
qa: -0.2758 -0.4723 -0.4076 -0.4072 -0.1140 0.1095 0.0556 -0.1071 -0.2810 -0.2652 -0.3041 0.4012 -0.0103 0.0916 -0.2209 -0.2854 -0.0736 -0.0717 -0.0724 -0.0711 -0.1341 -0.1369 0.3175 0.3198 0.0942 0.0871 0.0948 0.0938 0.0993 0.0876 0.0967 0.0971 0.1168 0.1353 0.1263 0.0847 0.0980 0.0945 0.1016 0.0948 0.1064 0.0996 0.0940 0.1013 0.0932 0.0808 0.0777 0.0819 0.0781
va: 2.1142 2.0316 2.1101 2.1102 3.1278 3.6931 3.7497 3.8932 3.9053 3.9127 3.8996 4.1421 3.6984 3.8805 3.9230 3.9416 3.6773 3.6634 3.9211 3.9217 3.9144 3.9134 4.2192 4.2171 1.0273 1.0357 1.0004 1.0192 0.9991 1.0056 1.0021 1.0023 1.0100 1.0026 1.0052 1.0104 0.9929 0.9938 0.9968 1.0038 0.9949 1.0049 1.0154 1.0052 1.0153 1.0094 1.0071 1.0095 1.0071
dispcorr: -0.021563391 hartree
energy: -1094.902036444337
dipole: 21.54719 -22.78603 -1.23884 -8.14264 7.47380 -0.66884 -10.74516 9.27227 -1.47290
magnitude: 2.03752 au
magnitude: 5.17897 debye
