program: Orca
programVersion: 5.0.2
elementType: O O O O N C C C C C C C C C C C C C C C C C C C H H H H H H H H H H H H H H H H H H H H H H H H H
charge: 0
multiplicity: 1
keywords: wb97x-d3
keywords: def2-TZVPP
keywords: def2/J RIJCOSX
keywords: DEFGRID2
keywords: scfconv7
keywords: smallprint printgap noloewdin
keywords: NOSOSCF
formula: C19H25NO4
InChI: InChI=1/C19H25NO4/c1-11(2)9-14-15(19(14,3)4)18(23)24-10-20-16(21)12-7-5-6-8-13(12)17(20)22/h9,14-15H,5-8,10H2,1-4H3
49 atoms
O  0.495072 1.681041 -1.185787
O  0.600132 1.28169 1.013992
O  -2.426328 2.136246 1.379392
O  -1.815807 0.021111 -2.605193
N  -1.795801 1.310428 -0.690548
C  3.673711 1.098233 0.404685
C  3.095253 -0.275486 0.558916
C  2.444937 0.704352 -0.396748
C  3.560861 2.05212 1.568646
C  4.945698 1.291956 -0.386013
C  3.754893 -1.483694 0.032566
C  1.104072 1.23569 -0.075674
C  3.915136 -2.64751 0.666844
C  -0.792577 2.255656 -1.054938
C  4.618761 -3.79289 0.001466
C  3.434519 -2.939212 2.056217
C  -3.35905 0.095636 0.483215
C  -3.194717 -0.515677 -0.689012
C  -4.295432 -0.340179 1.549049
C  -3.903212 -1.748529 -1.1157
C  -5.277615 -1.36595 0.979604
C  -4.575134 -2.397669 0.095843
C  -2.488606 1.302016 0.523412
C  -2.199773 0.246264 -1.491018
H  2.533289 -0.40697 1.476726
H  2.619789 0.540278 -1.454318
H  4.429523 1.935618 2.21942
H  2.670653 1.88544 2.169441
H  3.545178 3.088532 1.22467
H  5.004183 0.656457 -1.268421
H  5.816864 1.074333 0.234327
H  5.027815 2.326454 -0.723735
H  4.149176 -1.408954 -0.976606
H  -1.005015 2.66773 -2.039034
H  -0.802628 3.053227 -0.310912
H  5.493608 -4.105108 0.577498
H  4.953214 -3.542296 -1.004562
H  3.966481 -4.667019 -0.070766
H  2.751698 -3.792461 2.054763
H  2.918746 -2.106208 2.527625
H  4.272108 -3.214327 2.701876
H  -3.723693 -0.768278 2.378829
H  -4.820682 0.52136 1.96739
H  -4.643686 -1.49426 -1.88119
H  -3.206783 -2.438822 -1.597032
H  -5.804204 -1.865745 1.7940
H  -6.03929 -0.845919 0.391167
H  -5.287983 -3.153326 -0.237757
H  -3.819419 -2.923477 0.686606
totalener: -1094.85381944 hartree
nucrepener: 2093.57482801 hartree
electener: -3188.42864745 hartree
oneelecener: -5649.27952438 hartree
twoeener: 2460.85087692 hartree
kineticenergy: 1090.09379710 hartree
xcener: -105.972323829908 hartree
chargesum: 0.0000000
charge: -0.262109 -0.384542 -0.305091 -0.315579 -0.124419 0.082515 0.046432 -0.111325 -0.256699 -0.247046 -0.184499 0.352184 -0.052309 0.089186 -0.202132 -0.237290 -0.074336 -0.104558 -0.078698 -0.076476 -0.136063 -0.134608 0.278151 0.247497 0.088020 0.075879 0.084821 0.102915 0.083452 0.072531 0.092783 0.091057 0.072031 0.124536 0.125981 0.083427 0.076594 0.083758 0.085031 0.083630 0.085159 0.094669 0.093324 0.091357 0.093474 0.078913 0.074525 0.078077 0.075872
qa: -0.2621 -0.3845 -0.3051 -0.3156 -0.1244 0.0825 0.0464 -0.1113 -0.2567 -0.2470 -0.1845 0.3522 -0.0523 0.0892 -0.2021 -0.2373 -0.0743 -0.1046 -0.0787 -0.0765 -0.1361 -0.1346 0.2782 0.2475 0.0880 0.0759 0.0848 0.1029 0.0835 0.0725 0.0928 0.0911 0.0720 0.1245 0.1260 0.0834 0.0766 0.0838 0.0850 0.0836 0.0852 0.0947 0.0933 0.0914 0.0935 0.0789 0.0745 0.0781 0.0759
va: 2.1303 2.1144 2.2093 2.2015 3.0766 3.7367 3.7803 3.8618 3.9145 3.9182 3.9052 4.2293 3.8267 3.9096 3.9343 3.9453 3.6183 3.6470 3.9238 3.9287 3.8972 3.8991 4.2528 4.2836 1.0365 1.0373 1.0009 1.0218 1.0028 1.0110 1.0037 1.0044 1.0220 0.9949 1.0161 0.9980 1.0124 0.9983 0.9989 1.0160 0.9994 1.0075 1.0204 1.0081 1.0189 1.0116 1.0084 1.0114 1.0083
dispcorr: -0.022462926 hartree
energy: -1094.876282365090
dipole: 19.69714 -19.93437 -0.23723 -17.32676 16.46434 -0.86242 8.47970 -8.45671 0.02299
magnitude: 0.89475 au
magnitude: 2.27428 debye
