program: Orca
programVersion: 5.0.2
elementType: O O O O N C C C C C C C C C C C C C C C C C C C H H H H H H H H H H H H H H H H H H H H H H H H H
charge: 0
multiplicity: 1
keywords: wb97x-d3
keywords: def2-TZVPP
keywords: def2/J RIJCOSX
keywords: DEFGRID2
keywords: scfconv7
keywords: smallprint printgap noloewdin
keywords: NOSOSCF
formula: C19H25NO4
InChI: InChI=1/C19H25NO4/c1-11(2)9-14-15(19(14,3)4)18(23)24-10-20-16(21)12-7-5-6-8-13(12)17(20)22/h9,14-15H,5-8,10H2,1-4H3
49 atoms
O  0.403414 1.601937 0.026127
O  1.752058 1.853212 1.801617
O  -2.961432 2.291395 -1.120992
O  -1.121075 -0.626975 1.842516
N  -1.804623 1.120205 0.500817
C  4.021231 1.253414 -0.272935
C  3.671828 -0.003615 0.448251
C  2.568474 0.814454 -0.194518
C  4.511408 2.441278 0.517958
C  4.642897 1.153351 -1.646255
C  4.021026 -1.344484 -0.087665
C  1.577208 1.478241 0.673878
C  3.216344 -2.408018 -0.116373
C  -0.733408 2.023836 0.759658
C  3.686137 -3.720022 -0.669049
C  1.806366 -2.401894 0.389702
C  -3.57687 0.037782 -0.491175
C  -3.044676 -0.816183 0.382661
C  -4.755859 -0.241673 -1.348148
C  -3.55537 -2.182489 0.659941
C  -5.050053 -1.743277 -1.338487
C  -4.959364 -2.331418 0.069976
C  -2.792754 1.302484 -0.464349
C  -1.87304 -0.166132 1.029261
H  3.696457 0.083129 1.532228
H  2.158691 0.418149 -1.116301
H  4.268381 3.376207 0.0096
H  5.597806 2.392389 0.613237
H  4.09112 2.485161 1.518963
H  5.727615 1.054893 -1.570935
H  4.433391 2.052116 -2.228368
H  4.271626 0.297246 -2.209307
H  5.035291 -1.459712 -0.460639
H  -1.032266 3.014124 0.418405
H  -0.518697 2.052872 1.82661
H  3.643962 -4.502564 0.092588
H  4.708843 -3.668173 -1.04034
H  3.045866 -4.05194 -1.490352
H  1.100578 -2.576277 -0.427101
H  1.523911 -1.476784 0.88413
H  1.653947 -3.212825 1.105641
H  -5.615886 0.324696 -0.976122
H  -4.581101 0.120304 -2.363845
H  -2.871315 -2.91979 0.22741
H  -3.556409 -2.376328 1.734806
H  -6.038957 -1.928873 -1.760042
H  -4.334592 -2.253871 -1.989778
H  -5.245073 -3.384286 0.057219
H  -5.677658 -1.823369 0.720113
totalener: -1094.85427290 hartree
nucrepener: 2108.05995323 hartree
electener: -3202.91422613 hartree
oneelecener: -5678.01042000 hartree
twoeener: 2475.09619387 hartree
kineticenergy: 1090.09452770 hartree
xcener: -105.971326923161 hartree
chargesum: -0.0000000
charge: -0.271129 -0.381761 -0.318620 -0.324238 -0.112146 0.129401 -0.007298 -0.134359 -0.262348 -0.267221 -0.248202 0.350937 0.002221 0.073106 -0.213652 -0.222901 -0.098143 -0.070665 -0.075037 -0.074522 -0.136037 -0.134877 0.266580 0.254157 0.107267 0.089380 0.084533 0.081825 0.103677 0.088619 0.092066 0.085524 0.092767 0.112425 0.139571 0.087890 0.078253 0.082399 0.078206 0.096067 0.089329 0.092846 0.095268 0.091326 0.094662 0.080448 0.075846 0.080290 0.076271
qa: -0.2711 -0.3818 -0.3186 -0.3242 -0.1121 0.1294 -0.0073 -0.1344 -0.2623 -0.2672 -0.2482 0.3509 0.0022 0.0731 -0.2137 -0.2229 -0.0981 -0.0707 -0.0750 -0.0745 -0.1360 -0.1349 0.2666 0.2542 0.1073 0.0894 0.0845 0.0818 0.1037 0.0886 0.0921 0.0855 0.0928 0.1124 0.1396 0.0879 0.0783 0.0824 0.0782 0.0961 0.0893 0.0928 0.0953 0.0913 0.0947 0.0804 0.0758 0.0803 0.0763
va: 2.0992 2.1208 2.1957 2.1788 3.0988 3.7292 3.8094 3.8520 3.9062 3.9068 3.9014 4.1685 3.7354 3.8810 3.9419 3.9422 3.6508 3.6176 3.9239 3.9287 3.8991 3.8977 4.2814 4.2604 1.0248 1.0302 1.0020 1.0019 1.0217 1.0022 1.0061 1.0056 1.0105 1.0107 1.0143 0.9989 1.0100 0.9991 1.0006 1.0146 1.0040 1.0083 1.0190 1.0088 1.0188 1.0116 1.0085 1.0118 1.0087
dispcorr: -0.023868831 hartree
energy: -1094.878141729498
dipole: 14.48143 -15.42475 -0.94333 -16.56977 15.36474 -1.20504 -7.87778 7.09052 -0.78726
magnitude: 1.72098 au
magnitude: 4.37437 debye
