program: Orca
programVersion: 5.0.2
elementType: O O O O N C C C C C C C C C C C C C C C C C C C H H H H H H H H H H H H H H H H H H H H H H H H H
charge: 0
multiplicity: 1
keywords: wb97x-d3
keywords: def2-TZVPP
keywords: def2/J RIJCOSX
keywords: DEFGRID2
keywords: scfconv7
keywords: smallprint printgap noloewdin
keywords: NOSOSCF
formula: C19H25NO4
InChI: InChI=1/C19H25NO4/c1-11(2)9-14-15(19(14,3)4)18(23)24-10-20-16(21)12-7-5-6-8-13(12)17(20)22/h9,14-15H,5-8,10H2,1-4H3
49 atoms
O  0.585727 0.913764 -0.582754
O  1.871395 2.327138 -1.732663
O  -2.19679 -0.566082 -2.154254
O  -1.774429 2.088039 1.517834
N  -1.707965 0.976076 -0.504402
C  3.189996 0.683626 1.141657
C  2.837137 -0.576709 0.419579
C  2.928091 0.717126 -0.355312
C  2.200474 1.285255 2.110306
C  4.626207 0.914888 1.547443
C  3.842385 -1.648881 0.19547
C  1.771872 1.408796 -0.962901
C  4.02498 -2.3210 -0.941878
C  -0.562325 1.594708 -1.071109
C  5.073147 -3.386178 -1.05638
C  3.220846 -2.085824 -2.184035
C  -3.469482 -0.448688 -0.098592
C  -3.350624 0.333755 0.973861
C  -4.501995 -1.500128 -0.27774
C  -4.218973 0.274595 2.175693
C  -5.601322 -1.321887 0.772324
C  -5.027187 -1.024824 2.158285
C  -2.411916 -0.081574 -1.079228
C  -2.204849 1.258742 0.765729
H  1.824923 -0.929586 0.599043
H  3.819319 0.849854 -0.958363
H  2.377019 0.886651 3.111157
H  1.163772 1.0786 1.856337
H  2.318881 2.368981 2.164847
H  5.333596 0.487018 0.837501
H  4.82754 0.470932 2.524695
H  4.834554 1.983343 1.621648
H  4.461304 -1.91017 1.0498
H  -0.619718 1.524261 -2.157201
H  -0.536082 2.645094 -0.780552
H  4.628101 -4.350752 -1.31218
H  5.635754 -3.510207 -0.131884
H  5.783206 -3.150502 -1.853143
H  2.422401 -1.360578 -2.048024
H  2.764435 -3.018554 -2.524145
H  3.858183 -1.738793 -3.001529
H  -4.912853 -1.46113 -1.289087
H  -4.033403 -2.48549 -0.187463
H  -3.616805 0.354139 3.083569
H  -4.883174 1.145041 2.184745
H  -6.2567 -0.500155 0.469739
H  -6.224493 -2.216454 0.809548
H  -4.382304 -1.852354 2.467428
H  -5.831886 -0.968391 2.892596
totalener: -1094.85320699 hartree
nucrepener: 2098.69121575 hartree
electener: -3193.54442273 hartree
oneelecener: -5659.01178963 hartree
twoeener: 2465.46736690 hartree
kineticenergy: 1090.09229097 hartree
xcener: -105.970010413033 hartree
chargesum: -0.0000000
charge: -0.269107 -0.358221 -0.316463 -0.319770 -0.117063 0.114943 0.036499 -0.124285 -0.247606 -0.274503 -0.274165 0.323523 -0.001771 0.071263 -0.211958 -0.222436 -0.092945 -0.078945 -0.074042 -0.074549 -0.136133 -0.134795 0.264974 0.249866 0.097128 0.095296 0.081990 0.083215 0.094084 0.086251 0.087212 0.094932 0.092677 0.125801 0.126492 0.086938 0.078032 0.085079 0.084584 0.089834 0.089332 0.094538 0.093769 0.094756 0.093276 0.075880 0.080500 0.075918 0.080174
qa: -0.2691 -0.3582 -0.3165 -0.3198 -0.1171 0.1149 0.0365 -0.1243 -0.2476 -0.2745 -0.2742 0.3235 -0.0018 0.0713 -0.2120 -0.2224 -0.0929 -0.0789 -0.0740 -0.0745 -0.1361 -0.1348 0.2650 0.2499 0.0971 0.0953 0.0820 0.0832 0.0941 0.0863 0.0872 0.0949 0.0927 0.1258 0.1265 0.0869 0.0780 0.0851 0.0846 0.0898 0.0893 0.0945 0.0938 0.0948 0.0933 0.0759 0.0805 0.0759 0.0802
va: 2.0682 2.1446 2.1968 2.1882 3.1113 3.7329 3.7610 3.8613 3.9155 3.9131 3.9120 4.1945 3.7305 3.9123 3.9421 3.9380 3.6415 3.6285 3.9245 3.9261 3.8980 3.8988 4.2648 4.2672 1.0223 1.0262 1.0036 1.0158 1.0032 1.0055 1.0017 1.0055 1.0103 1.0059 1.0027 0.9992 1.0097 0.9995 1.0194 1.0023 1.0010 1.0191 1.0084 1.0193 1.0078 1.0086 1.0118 1.0087 1.0120
dispcorr: -0.023724033 hartree
energy: -1094.876931018812
dipole: 14.15574 -15.23599 -1.08025 -14.82341 13.63250 -1.19091 8.36983 -7.37409 0.99574
magnitude: 1.89122 au
magnitude: 4.80709 debye
