program: Orca
programVersion: 5.0.2
elementType: O O O O N C C C C C C C C C C C C C C C C C C C H H H H H H H H H H H H H H H H H H H H H H H H H
charge: 0
multiplicity: 1
keywords: wb97x-d3
keywords: def2-TZVPP
keywords: def2/J RIJCOSX
keywords: DEFGRID2
keywords: scfconv7
keywords: smallprint printgap noloewdin
keywords: NOSOSCF
formula: C19H25NO4
InChI: InChI=1/C19H25NO4/c1-11(2)9-14-15(19(14,3)4)18(23)24-10-20-16(21)12-7-5-6-8-13(12)17(20)22/h9,14-15H,5-8,10H2,1-4H3
49 atoms
O  0.499603 1.18615 -0.817829
O  1.749617 2.766692 -1.772843
O  -1.839654 1.822046 1.453386
O  -2.237783 -0.090512 -2.655436
N  -1.787409 1.135129 -0.749521
C  3.095665 0.817684 0.880304
C  2.774307 -0.357499 0.002349
C  2.842639 1.018283 -0.604188
C  2.085847 1.270617 1.907065
C  4.522332 1.014325 1.331309
C  3.794161 -1.372739 -0.370447
C  1.670766 1.754705 -1.129031
C  4.138317 -2.415866 0.386035
C  -0.673592 1.892272 -1.200297
C  5.156292 -3.415359 -0.072094
C  3.541378 -2.681045 1.734608
C  -3.302592 0.080122 0.624805
C  -3.418654 -0.479654 -0.579257
C  -4.102766 -0.289225 1.819537
C  -4.384162 -1.550213 -0.932564
C  -4.824829 -1.613406 1.562139
C  -5.444109 -1.662242 0.164926
C  -2.242489 1.1216 0.566617
C  -2.438335 0.156492 -1.500116
H  1.767775 -0.746408 0.126553
H  3.73422 1.250609 -1.177473
H  1.055818 1.065605 1.626237
H  2.171538 2.342875 2.092751
H  2.273729 0.761531 2.854781
H  4.725791 0.42092 2.225167
H  4.704807 2.061605 1.577694
H  5.245243 0.716096 0.573389
H  4.273664 -1.255035 -1.338014
H  -0.7291 1.998107 -2.283446
H  -0.691045 2.880739 -0.740774
H  5.992635 -3.474516 0.628701
H  5.558125 -3.169826 -1.054085
H  4.725773 -4.418249 -0.127429
H  3.02444 -3.644194 1.747862
H  2.8313 -1.915221 2.041163
H  4.320723 -2.738732 2.498484
H  -3.461183 -0.353856 2.701187
H  -4.82054 0.508979 2.035151
H  -4.839862 -1.345637 -1.903797
H  -3.847356 -2.496934 -1.052326
H  -4.11397 -2.437743 1.670486
H  -5.594454 -1.767818 2.319775
H  -6.159303 -0.841347 0.058688
H  -6.011793 -2.58514 0.037857
totalener: -1094.85310404 hartree
nucrepener: 2094.57142765 hartree
electener: -3189.42453170 hartree
oneelecener: -5650.68725897 hartree
twoeener: 2461.26272727 hartree
kineticenergy: 1090.09518104 hartree
xcener: -105.969850558450 hartree
chargesum: 0.0000000
charge: -0.267698 -0.359615 -0.320919 -0.313322 -0.120313 0.080045 0.011375 -0.096146 -0.261080 -0.246665 -0.215306 0.324034 -0.020938 0.077302 -0.211453 -0.240788 -0.074062 -0.091657 -0.075510 -0.074811 -0.134597 -0.134969 0.245347 0.261746 0.100000 0.083316 0.089140 0.097354 0.080419 0.083417 0.098301 0.082130 0.091669 0.126533 0.126788 0.084302 0.080633 0.085274 0.095396 0.080079 0.086879 0.094327 0.093416 0.094971 0.093799 0.075454 0.080340 0.075974 0.080089
qa: -0.2677 -0.3596 -0.3209 -0.3133 -0.1203 0.0800 0.0114 -0.0961 -0.2611 -0.2467 -0.2153 0.3240 -0.0209 0.0773 -0.2115 -0.2408 -0.0741 -0.0917 -0.0755 -0.0748 -0.1346 -0.1350 0.2453 0.2617 0.1000 0.0833 0.0891 0.0974 0.0804 0.0834 0.0983 0.0821 0.0917 0.1265 0.1268 0.0843 0.0806 0.0853 0.0954 0.0801 0.0869 0.0943 0.0934 0.0950 0.0938 0.0755 0.0803 0.0760 0.0801
va: 2.0859 2.1446 2.1869 2.2007 3.1160 3.7116 3.7843 3.8954 3.9182 3.9117 3.8646 4.2678 3.7353 3.9067 3.9405 3.9397 3.6275 3.6331 3.9263 3.9242 3.8972 3.8965 4.2690 4.2701 1.0210 1.0314 1.0147 1.0044 1.0032 1.0023 1.0052 1.0075 1.0142 1.0062 1.0007 0.9987 1.0107 0.9979 1.0022 1.0106 1.0003 1.0190 1.0081 1.0193 1.0085 1.0087 1.0116 1.0088 1.0120
dispcorr: -0.023871452 hartree
energy: -1094.876975494834
dipole: 15.42229 -16.39241 -0.97012 -18.39690 16.89421 -1.50269 15.93021 -14.78675 1.14346
magnitude: 2.12290 au
magnitude: 5.39598 debye
