program: Orca
programVersion: 5.0.2
elementType: O O O O N C C C C C C C C C C C C C C C C C C C H H H H H H H H H H H H H H H H H H H H H H H H H
charge: 0
multiplicity: 1
keywords: wb97x-d3
keywords: def2-TZVPP
keywords: def2/J RIJCOSX
keywords: DEFGRID2
keywords: scfconv7
keywords: smallprint printgap noloewdin
keywords: NOSOSCF
formula: C19H25NO4
InChI: InChI=1/C19H25NO4/c1-11(2)9-14-15(19(14,3)4)18(23)24-10-20-16(21)12-7-5-6-8-13(12)17(20)22/h9,14-15H,5-8,10H2,1-4H3
49 atoms
O  0.117256 0.813604 0.048747
O  1.602209 2.166466 1.022717
O  -2.456684 0.083271 2.180612
O  -2.473499 1.607099 -2.10869
N  -2.158498 1.083809 0.119986
C  3.66801 0.396664 -0.54219
C  3.59218 -0.065469 0.878375
C  2.317853 0.081194 0.084415
C  4.078655 1.821506 -0.820664
C  4.128028 -0.573894 -1.602878
C  4.024055 -1.417032 1.319967
C  1.352986 1.139495 0.447339
C  5.291134 -1.806132 1.465897
C  -0.919841 1.735945 0.358535
C  5.633923 -3.180588 1.95512
C  6.464715 -0.921928 1.173865
C  -3.955822 -0.338867 0.328805
C  -3.960223 0.10694 -0.927057
C  -4.959616 -1.264685 0.910065
C  -4.958446 -0.265242 -1.960479
C  -6.173343 -1.34859 -0.017532
C  -5.761172 -1.478041 -1.484342
C  -2.793685 0.253859 1.04272
C  -2.802117 1.022467 -1.114885
H  3.735861 0.726351 1.610265
H  1.861191 -0.837799 -0.267014
H  5.164085 1.87152 -0.931741
H  3.793759 2.508346 -0.028047
H  3.639276 2.181845 -1.752694
H  3.738746 -0.283514 -2.580186
H  3.808073 -1.595134 -1.4017
H  5.217888 -0.58105 -1.668709
H  3.236751 -2.123258 1.568061
H  -0.848202 2.617325 -0.279233
H  -0.868457 2.042348 1.402911
H  6.212467 -3.13413 2.881135
H  6.251786 -3.714082 1.228465
H  4.745288 -3.780914 2.146454
H  6.1746 0.064627 0.817672
H  7.113699 -1.375713 0.420471
H  7.077777 -0.78803 2.068722
H  -4.504685 -2.251349 1.045459
H  -5.247997 -0.933507 1.91015
H  -5.618848 0.58733 -2.149593
H  -4.461577 -0.469375 -2.911534
H  -6.802174 -2.191996 0.271294
H  -6.783558 -0.449488 0.108364
H  -6.64347 -1.606685 -2.11291
H  -5.156276 -2.380585 -1.610313
totalener: -1094.85578637 hartree
nucrepener: 2033.28751907 hartree
electener: -3128.14330543 hartree
oneelecener: -5528.36703311 hartree
twoeener: 2400.22372767 hartree
kineticenergy: 1090.09418900 hartree
xcener: -105.970135413629 hartree
chargesum: -0.0000000
charge: -0.263949 -0.390208 -0.315709 -0.316874 -0.128113 0.062112 -0.028445 -0.079560 -0.262240 -0.245872 -0.186050 0.343112 -0.021372 0.092741 -0.209651 -0.246742 -0.085621 -0.092246 -0.076042 -0.074286 -0.134689 -0.136111 0.262376 0.262967 0.108323 0.078900 0.079187 0.104990 0.090076 0.098521 0.083195 0.083530 0.089915 0.124032 0.122913 0.086332 0.083590 0.079455 0.084233 0.088630 0.098201 0.093114 0.094099 0.092606 0.094979 0.080131 0.075410 0.080312 0.075799
qa: -0.2639 -0.3902 -0.3157 -0.3169 -0.1281 0.0621 -0.0284 -0.0796 -0.2622 -0.2459 -0.1861 0.3431 -0.0214 0.0927 -0.2097 -0.2467 -0.0856 -0.0922 -0.0760 -0.0743 -0.1347 -0.1361 0.2624 0.2630 0.1083 0.0789 0.0792 0.1050 0.0901 0.0985 0.0832 0.0835 0.0899 0.1240 0.1229 0.0863 0.0836 0.0795 0.0842 0.0886 0.0982 0.0931 0.0941 0.0926 0.0950 0.0801 0.0754 0.0803 0.0758
va: 2.1169 2.1099 2.1988 2.1976 3.1192 3.7416 3.8177 3.8655 3.9061 3.9075 3.8618 4.2181 3.7341 3.8970 3.9373 3.9351 3.6152 3.6324 3.9274 3.9256 3.8969 3.8990 4.2778 4.2774 1.0257 1.0336 1.0024 1.0214 1.0028 1.0060 1.0072 1.0021 1.0130 1.0023 1.0058 0.9983 0.9990 1.0106 1.0104 0.9982 1.0040 1.0083 1.0190 1.0080 1.0189 1.0118 1.0087 1.0116 1.0088
dispcorr: -0.022572188 hartree
energy: -1094.878358555474
dipole: 23.61825 -24.38153 -0.76327 -14.88046 13.64839 -1.23208 -2.85993 2.32973 -0.53020
magnitude: 1.54328 au
magnitude: 3.92270 debye
