program: Orca
programVersion: 5.0.3
elementType: Cl F F F F F F F O O C C C C C C C C C C C C C C C C C H H H H H H H H H H H H H H
charge: 0
multiplicity: 1
keywords: wb97x-d3
keywords: def2-TZVPP
keywords: def2/J RIJCOSX
keywords: DEFGRID2
keywords: scfconv7
keywords: smallprint printgap noloewdin
keywords: NOSOSCF
formula: C17H14ClF7O2
InChI: InChI=1/C17H14ClF7O2/c1-6-11(19)13(21)7(14(22)12(6)20)5-27-15(26)10-8(16(10,2)3)4-9(18)17(23,24)25/h4,8,10H,5H2,1-3H3
41 atoms
Cl -1.548237 1.082308 1.264263
F  -1.953429 3.231415 -0.827309
F  -1.590619 1.95103 -2.51878
F  -0.045885 2.27797 -1.056119
F  3.182672 -1.336609 -1.380324
F  0.970881 -0.631548 2.705888
F  1.510348 1.9608 2.547405
F  3.785286 1.238181 -1.49825
O  0.272582 -2.709908 0.889682
O  -0.092299 -1.882225 -1.152245
C  -3.07215 -2.657428 -0.677616
C  -2.896633 -1.285157 -0.129936
C  -1.936582 -2.397342 0.293625
C  -2.819843 -2.956434 -2.133875
C  -4.206944 -3.471252 -0.100384
C  -2.414291 -0.155648 -0.947022
C  -0.521907 -2.299402 -0.102238
C  -1.843895 0.92287 -0.427936
C  1.680055 -2.530694 0.731841
C  -1.361728 2.097296 -1.215715
C  2.049952 -1.076055 0.664628
C  2.770016 -0.5441 -0.39006
C  1.658248 -0.188448 1.652916
C  1.9520 1.157883 1.576561
C  3.083449 0.799763 -0.449964
C  2.685728 1.6923 0.531021
C  3.001802 3.152673 0.457239
H  -3.570751 -0.991391 0.669404
H  -2.088594 -2.770557 1.298752
H  -2.057795 -2.337347 -2.598234
H  -2.520353 -3.997893 -2.258006
H  -3.744988 -2.812837 -2.694272
H  -4.003382 -4.539021 -0.192589
H  -4.370766 -3.251157 0.954949
H  -5.135246 -3.260624 -0.63373
H  -2.554815 -0.194129 -2.020473
H  2.041063 -3.071218 -0.142163
H  2.121492 -2.998651 1.609948
H  3.11492 3.58519 1.448589
H  3.924538 3.334816 -0.088234
H  2.203153 3.694493 -0.050688
elementType: Cl F O C H
totalener: -1965.97682056 hartree
nucrepener: 3063.54675146 hartree
electener: -5029.52357202 hartree
oneelecener: -8808.88936786 hartree
twoeener: 3779.36579584 hartree
cpcmener: -0.02510023 hartree
kineticenergy: 1959.84089659 hartree
xcener: -152.606733663217 hartree
chargesum: -0.0000000
charge: -0.072807 -0.174724 -0.169715 -0.164591 -0.208365 -0.203095 -0.208627 -0.210153 -0.282316 -0.478624 0.107981 -0.077628 -0.082425 -0.282621 -0.258034 -0.085201 0.406125 -0.062191 0.066850 0.506569 -0.134246 0.267925 0.171709 0.205868 0.233801 -0.149703 -0.207435 0.123926 0.098636 0.091463 0.103677 0.101791 0.098753 0.090393 0.097048 0.152798 0.122599 0.139060 0.107362 0.106931 0.111242
qa: -0.0728 -0.1747 -0.1697 -0.1646 -0.2084 -0.2031 -0.2086 -0.2102 -0.2823 -0.4786 0.1080 -0.0776 -0.0824 -0.2826 -0.2580 -0.0852 0.4061 -0.0622 0.0669 0.5066 -0.1342 0.2679 0.1717 0.2059 0.2338 -0.1497 -0.2074 0.1239 0.0986 0.0915 0.1037 0.1018 0.0988 0.0904 0.0970 0.1528 0.1226 0.1391 0.1074 0.1069 0.1112
va: 1.2714 1.1266 1.1357 1.1216 1.0883 1.0869 1.0836 1.0879 2.1237 2.0117 3.7955 3.8652 3.8740 3.8955 3.9003 3.7853 4.0637 3.9396 3.8442 4.4681 3.5856 3.8735 3.9456 3.8866 3.9227 3.6833 3.9086 1.0109 1.0313 1.0167 0.9996 0.9989 1.0019 1.0042 1.0021 1.0037 1.0174 0.9916 1.0043 1.0057 1.0021
dispcorr: -0.024629696 hartree
energy: -1966.001450259444
dipole: -19.16717 18.14308 -1.02409 -27.88555 26.50944 -1.37610 -4.09302 4.70860 0.61559
magnitude: 1.82246 au
magnitude: 4.63233 debye
