program: Orca
programVersion: 5.0.3
elementType: Cl F F F F F F F O O C C C C C C C C C C C C C C C C C H H H H H H H H H H H H H H
charge: 0
multiplicity: 1
keywords: wb97x-d3
keywords: def2-TZVPP
keywords: def2/J RIJCOSX
keywords: DEFGRID2
keywords: scfconv7
keywords: smallprint printgap noloewdin
keywords: NOSOSCF
formula: C17H14ClF7O2
InChI: InChI=1/C17H14ClF7O2/c1-6-11(19)13(21)7(14(22)12(6)20)5-27-15(26)10-8(16(10,2)3)4-9(18)17(23,24)25/h4,8,10H,5H2,1-3H3
41 atoms
Cl -1.549988 0.823749 1.811637
F  -2.360519 3.236295 0.199399
F  -2.05294 2.328148 -1.728238
F  -0.405183 2.550807 -0.361424
F  1.262717 -0.69216 2.435062
F  3.066046 -1.334305 -1.857303
F  3.707835 1.227903 -1.974293
F  1.820089 1.905424 2.273903
O  0.375817 -2.743874 0.676354
O  -0.227385 -1.707154 -1.206067
C  -3.104133 -2.64516 -0.555391
C  -2.924313 -1.361456 0.177281
C  -1.891783 -2.474956 0.33912
C  -2.977554 -2.713478 -2.056557
C  -4.151347 -3.58944 -0.011929
C  -2.571586 -0.092238 -0.488282
C  -0.528374 -2.262738 -0.178185
C  -2.011095 0.925243 0.15205
C  1.754302 -2.552705 0.363517
C  -1.70868 2.261839 -0.444412
C  2.131994 -1.100726 0.290911
C  1.84741 -0.229654 1.329799
C  2.761163 -0.558859 -0.815241
C  3.092393 0.780509 -0.876789
C  2.149586 1.11496 1.250229
C  2.794236 1.659106 0.150774
C  3.120033 3.117185 0.071666
H  -3.532095 -1.226775 1.067243
H  -1.930538 -2.996929 1.287512
H  -2.294496 -1.986746 -2.484978
H  -2.638659 -3.703655 -2.36305
H  -3.957321 -2.549532 -2.508021
H  -5.132785 -3.351264 -0.426059
H  -3.91885 -4.621712 -0.278844
H  -4.227189 -3.535639 1.074659
H  -2.816469 0.033262 -1.536178
H  2.007189 -3.069415 -0.561796
H  2.293295 -3.048086 1.169995
H  3.35199 3.5281 1.051821
H  3.976512 3.302066 -0.572482
H  2.276115 3.679608 -0.330992
elementType: Cl F O C H
totalener: -1965.98865568 hartree
nucrepener: 3046.00302147 hartree
electener: -5011.99167715 hartree
oneelecener: -8773.66818366 hartree
twoeener: 3761.67650651 hartree
cpcmener: -0.02097793 hartree
kineticenergy: 1959.83609681 hartree
xcener: -152.604318649426 hartree
chargesum: -0.0000000
charge: -0.072123 -0.172614 -0.169347 -0.164974 -0.201219 -0.207331 -0.208896 -0.208116 -0.277737 -0.453751 0.105528 -0.088386 -0.076683 -0.281809 -0.257020 -0.082174 0.391781 -0.063069 0.065995 0.503197 -0.127521 0.166902 0.262615 0.239912 0.222662 -0.163960 -0.209958 0.121062 0.096201 0.092889 0.102341 0.100691 0.096755 0.098161 0.088678 0.149109 0.121488 0.135581 0.106734 0.106070 0.112335
qa: -0.0721 -0.1726 -0.1693 -0.1650 -0.2012 -0.2073 -0.2089 -0.2081 -0.2777 -0.4538 0.1055 -0.0884 -0.0767 -0.2818 -0.2570 -0.0822 0.3918 -0.0631 0.0660 0.5032 -0.1275 0.1669 0.2626 0.2399 0.2227 -0.1640 -0.2100 0.1211 0.0962 0.0929 0.1023 0.1007 0.0968 0.0982 0.0887 0.1491 0.1215 0.1356 0.1067 0.1061 0.1123
va: 1.2704 1.1280 1.1365 1.1247 1.0910 1.0903 1.0901 1.0857 2.1288 2.0406 3.7924 3.8748 3.8631 3.8951 3.8997 3.7867 4.0851 3.9493 3.8543 4.4747 3.5885 3.9480 3.8790 3.9199 3.8747 3.7295 3.9101 1.0115 1.0316 1.0183 1.0000 0.9991 1.0022 1.0020 1.0044 1.0048 1.0164 0.9903 1.0040 1.0069 1.0018
dispcorr: -0.024141769 hartree
energy: -1966.012797451128
dipole: -18.10359 17.30522 -0.79837 -28.01245 26.52846 -1.48400 -6.77413 7.14509 0.37095
magnitude: 1.72547 au
magnitude: 4.38580 debye
