program: Orca
programVersion: 5.0.2
elementType: Si F O O C C C C C C C C C C C C C C C C C C C C C C C C C H H H H H H H H H H H H H H H H H H H H H H H H H H H H H
charge: 0
multiplicity: 1
keywords: wb97x-d3
keywords: def2-TZVPP
keywords: def2/J RIJCOSX
keywords: DEFGRID2
keywords: scfconv7
keywords: smallprint printgap noloewdin
keywords: NOSOSCF
formula: C25H29FO2Si
InChI: InChI=1/C25H29FO2Si/c1-4-27-21-13-15-23(16-14-21)29(2,3)18-8-9-20-12-17-24(26)25(19-20)28-22-10-6-5-7-11-22/h5-7,10-17,19H,4,8-9,18H2,1-3H3
58 atoms
Si -3.896276 1.19323 0.45464
F  1.407062 -3.344773 -1.976999
O  1.842182 2.965874 -0.301009
O  1.490926 -0.724037 -1.262585
C  -3.969691 -0.695904 0.303571
C  -3.606756 -1.515229 1.543337
C  -2.139007 1.836547 0.253075
C  -4.557454 1.72921 2.132215
C  -4.941845 1.908661 -0.939793
C  -2.136724 -1.447293 1.962798
C  -1.507193 1.818693 -0.99601
C  -1.379626 2.28766 1.330306
C  -1.187805 -1.959944 0.913128
C  -0.187953 2.201453 -1.156331
C  -0.051534 2.677443 1.196147
C  0.559968 2.622411 -0.054185
C  -0.234481 -1.121259 0.344356
C  -1.247195 -3.282697 0.477213
C  0.620998 -1.58189 -0.6424
C  -0.381058 -3.762254 -0.495513
C  0.548885 -2.904809 -1.045403
C  2.68789 3.358201 0.778524
C  3.183125 2.187966 1.601318
C  2.797275 -0.685905 -0.86137
C  3.630796 0.153137 -1.593605
C  3.293111 -1.415371 0.21018
C  4.969868 0.250999 -1.253545
C  4.639266 -1.30251 0.538898
C  5.483876 -0.475656 -0.185697
H  -5.0017 -0.93525 0.023296
H  -3.362994 -1.010896 -0.552912
H  -3.872533 -2.563556 1.375518
H  -4.215677 -1.190639 2.391575
H  -4.581306 2.816737 2.224426
H  -5.5765 1.367517 2.283942
H  -3.952586 1.344435 2.955865
H  -4.926373 3.000198 -0.935975
H  -4.583586 1.580341 -1.917904
H  -5.984032 1.593147 -0.85611
H  -1.866013 -0.421454 2.22322
H  -2.012756 -2.035232 2.876455
H  -2.048165 1.486882 -1.875854
H  -1.814554 2.332477 2.322292
H  0.273917 2.168543 -2.135692
H  0.481949 3.009896 2.076115
H  -0.153861 -0.090504 0.666551
H  -1.977728 -3.959663 0.902774
H  -0.428679 -4.792802 -0.823202
H  2.187187 4.102015 1.404662
H  3.530552 3.859735 0.302914
H  3.829767 2.562385 2.395963
H  2.374821 1.627528 2.071044
H  3.770365 1.49996 0.993665
H  3.230479 0.719104 -2.425451
H  2.655462 -2.064724 0.796063
H  5.613386 0.904376 -1.828193
H  5.021455 -1.873722 1.37478
H  6.529852 -0.395285 0.077801
elementType: Si F O C H
totalener: -1510.05244854 hartree
nucrepener: 3023.59153220 hartree
electener: -4533.64398074 hartree
oneelecener: -8078.36193327 hartree
twoeener: 3544.71795253 hartree
cpcmener: -0.02755174 hartree
kineticenergy: 1503.91635244 hartree
xcener: -135.239038463350 hartree
chargesum: -0.0000000
charge: 0.497378 -0.219404 -0.350696 -0.330489 -0.266093 -0.161798 -0.143921 -0.445132 -0.461466 -0.115586 -0.082790 -0.175271 -0.065905 -0.342563 -0.214879 0.356119 -0.104000 -0.126433 0.104207 -0.218595 0.283610 0.042547 -0.244257 0.328105 -0.298407 -0.192750 -0.099619 -0.161432 -0.192317 0.097756 0.080709 0.094066 0.088512 0.114755 0.113774 0.102041 0.102146 0.101403 0.103563 0.091998 0.104090 0.135158 0.145028 0.136278 0.139031 0.128603 0.145413 0.149654 0.098352 0.112911 0.107149 0.096455 0.041891 0.145990 0.147336 0.157995 0.161142 0.158638
qa: 0.4974 -0.2194 -0.3507 -0.3305 -0.2661 -0.1618 -0.1439 -0.4451 -0.4615 -0.1156 -0.0828 -0.1753 -0.0659 -0.3426 -0.2149 0.3561 -0.1040 -0.1264 0.1042 -0.2186 0.2836 0.0425 -0.2443 0.3281 -0.2984 -0.1928 -0.0996 -0.1614 -0.1923 0.0978 0.0807 0.0941 0.0885 0.1148 0.1138 0.1020 0.1021 0.1014 0.1036 0.0920 0.1041 0.1352 0.1450 0.1363 0.1390 0.1286 0.1454 0.1497 0.0984 0.1129 0.1071 0.0965 0.0419 0.1460 0.1473 0.1580 0.1611 0.1586
va: 4.1067 1.0688 2.0386 2.0488 3.8337 3.8941 3.6502 3.9097 3.9059 3.8071 3.8078 3.8732 3.6831 3.9842 3.8691 3.6745 3.8320 3.8322 3.7323 3.9453 4.0028 3.8344 3.9143 3.5915 3.9496 3.8646 3.8450 3.8950 3.8784 1.0055 1.0140 1.0011 1.0014 1.0086 1.0068 1.0055 1.0095 1.0109 1.0104 1.0085 1.0061 0.9932 0.9896 1.0144 1.0061 0.9929 0.9993 0.9991 0.9994 0.9923 1.0146 1.0009 1.0128 1.0111 1.0091 0.9895 0.9901 0.9906
dispcorr: -0.036224734 hartree
energy: -1510.088673268688
dipole: -17.64204 17.27412 -0.36792 14.79689 -14.80072 -0.00383 17.67710 -15.73714 1.93996
magnitude: 1.97455 au
magnitude: 5.01889 debye
