program: Orca
programVersion: 5.0.2
elementType: Si F O O C C C C C C C C C C C C C C C C C C C C C C C C C H H H H H H H H H H H H H H H H H H H H H H H H H H H H H
charge: 0
multiplicity: 1
keywords: wb97x-d3
keywords: def2-TZVPP
keywords: def2/J RIJCOSX
keywords: DEFGRID2
keywords: scfconv7
keywords: smallprint printgap noloewdin
keywords: NOSOSCF
formula: C25H29FO2Si
InChI: InChI=1/C25H29FO2Si/c1-4-27-21-13-15-23(16-14-21)29(2,3)18-8-9-20-12-17-24(26)25(19-20)28-22-10-6-5-7-11-22/h5-7,10-17,19H,4,8-9,18H2,1-3H3
58 atoms
Si -3.727502 1.635467 0.57914
F  1.910604 -4.762727 -0.663321
O  2.055842 2.783046 -0.800521
O  2.249037 -2.121486 -0.500489
C  -4.233493 0.089386 -0.405374
C  -3.110962 -0.907596 -0.689222
C  -1.934983 2.038583 0.166144
C  -3.920586 1.368249 2.432236
C  -4.823948 3.071934 0.04734
C  -2.521902 -1.541767 0.570955
C  -1.589472 2.475616 -1.113073
C  -0.884572 1.856558 1.070959
C  -1.345018 -2.42111 0.261707
C  -0.275739 2.726104 -1.488567
C  0.433277 2.100883 0.722721
C  0.749573 2.543562 -0.562566
C  -0.095286 -1.846361 0.04326
C  -1.477515 -3.800951 0.146113
C  1.005781 -2.633108 -0.255191
C  -0.386828 -4.597384 -0.175373
C  0.843565 -4.006964 -0.364189
C  2.483429 3.239884 -2.078902
C  2.595842 2.128824 -3.100425
C  2.770706 -1.161924 0.331819
C  3.671667 -0.274859 -0.240612
C  2.472141 -1.09274 1.687143
C  4.274621 0.69297 0.548918
C  3.076085 -0.112164 2.461394
C  3.976095 0.78462 1.901305
H  -5.056746 -0.409975 0.11774
H  -4.655227 0.428325 -1.357216
H  -2.31014 -0.408561 -1.242718
H  -3.475122 -1.707361 -1.341606
H  -3.687257 2.273649 2.99616
H  -4.954145 1.101312 2.664044
H  -3.289061 0.56702 2.819208
H  -5.880356 2.843176 0.203747
H  -4.598315 3.977874 0.613421
H  -4.697224 3.306493 -1.011561
H  -2.204605 -0.762655 1.269048
H  -3.295071 -2.119647 1.083218
H  -2.360431 2.62903 -1.860858
H  -1.08905 1.512564 2.078788
H  -0.07747 3.060231 -2.497911
H  1.227736 1.95241 1.44485
H  0.020697 -0.770161 0.118814
H  -2.441686 -4.264845 0.31145
H  -0.488224 -5.671214 -0.264758
H  3.465194 3.679295 -1.902933
H  1.835629 4.044661 -2.437522
H  3.299389 1.363059 -2.773327
H  1.640102 1.647727 -3.309098
H  2.968167 2.543143 -4.037817
H  3.899005 -0.344909 -1.296841
H  1.780794 -1.788607 2.14398
H  4.973446 1.384564 0.096822
H  2.838304 -0.054831 3.515396
H  4.438546 1.547273 2.513155
elementType: Si F O C H
totalener: -1510.05086949 hartree
nucrepener: 2978.20954107 hartree
electener: -4488.26041057 hartree
oneelecener: -7987.15266760 hartree
twoeener: 3498.89225703 hartree
cpcmener: -0.02838198 hartree
kineticenergy: 1503.91746939 hartree
xcener: -135.236495790042 hartree
chargesum: -0.0000000
charge: 0.481008 -0.220219 -0.343816 -0.342634 -0.280326 -0.120434 -0.120155 -0.430686 -0.462868 -0.080020 -0.188422 -0.120517 -0.000922 -0.230633 -0.297037 0.345364 -0.174456 -0.188080 0.196213 -0.179281 0.186902 0.032615 -0.267727 0.320881 -0.279822 -0.187932 -0.140212 -0.164399 -0.176678 0.084996 0.097577 0.078066 0.094366 0.109569 0.109602 0.104045 0.102575 0.100950 0.100621 0.080745 0.096595 0.137013 0.142716 0.142695 0.155961 0.118079 0.142336 0.149689 0.111343 0.096708 0.087147 0.093661 0.102098 0.160480 0.155167 0.159883 0.160592 0.159015
qa: 0.4810 -0.2202 -0.3438 -0.3426 -0.2803 -0.1204 -0.1202 -0.4307 -0.4629 -0.0800 -0.1884 -0.1205 -0.0009 -0.2306 -0.2970 0.3454 -0.1745 -0.1881 0.1962 -0.1793 0.1869 0.0326 -0.2677 0.3209 -0.2798 -0.1879 -0.1402 -0.1644 -0.1767 0.0850 0.0976 0.0781 0.0944 0.1096 0.1096 0.1040 0.1026 0.1009 0.1006 0.0807 0.0966 0.1370 0.1427 0.1427 0.1560 0.1181 0.1423 0.1497 0.1113 0.0967 0.0871 0.0937 0.1021 0.1605 0.1552 0.1599 0.1606 0.1590
va: 4.0788 1.0649 2.0511 2.0679 3.8528 3.8577 3.6909 3.8914 3.9017 3.7378 3.9158 3.8208 3.6741 3.9021 3.9502 3.7525 3.8917 3.8911 3.6831 3.8812 4.0443 3.8409 3.9131 3.6356 3.9368 3.8583 3.8394 3.8625 3.8556 1.0137 1.0087 1.0094 1.0085 1.0076 1.0099 1.0105 1.0105 1.0114 1.0124 1.0193 1.0142 0.9944 0.9911 1.0024 1.0019 1.0210 1.0033 0.9980 0.9923 0.9990 1.0039 1.0022 1.0106 0.9972 0.9975 0.9885 0.9903 0.9899
dispcorr: -0.034598887 hartree
energy: -1510.085468379346
dipole: -22.24384 21.14492 -1.09892 24.78579 -23.78231 1.00348 -0.99039 0.79348 -0.19691
magnitude: 1.50113 au
magnitude: 3.81556 debye
