program: Orca
programVersion: 5.0.2
elementType: Si F O O C C C C C C C C C C C C C C C C C C C C C C C C C H H H H H H H H H H H H H H H H H H H H H H H H H H H H H
charge: 0
multiplicity: 1
keywords: wb97x-d3
keywords: def2-TZVPP
keywords: def2/J RIJCOSX
keywords: DEFGRID2
keywords: scfconv7
keywords: smallprint printgap noloewdin
keywords: NOSOSCF
formula: C25H29FO2Si
InChI: InChI=1/C25H29FO2Si/c1-4-27-21-13-15-23(16-14-21)29(2,3)18-8-9-20-12-17-24(26)25(19-20)28-22-10-6-5-7-11-22/h5-7,10-17,19H,4,8-9,18H2,1-3H3
58 atoms
Si -3.325313 1.212162 0.833933
F  1.199469 -4.935574 0.385625
O  2.221699 3.323304 -0.385176
O  1.516806 -2.393068 1.127392
C  -3.573588 -0.631284 0.477821
C  -3.646065 -1.056295 -0.989546
C  -1.606152 1.85355 0.40893
C  -3.595629 1.461426 2.681115
C  -4.588225 2.196292 -0.155679
C  -2.299587 -1.070251 -1.719673
C  -1.363982 2.603693 -0.740359
C  -0.507852 1.618364 1.244873
C  -1.349183 -2.098039 -1.170688
C  -0.10585 3.103411 -1.056722
C  0.754431 2.102114 0.951496
C  0.966829 2.858558 -0.203293
C  -0.32718 -1.735334 -0.300345
C  -1.501998 -3.445291 -1.494582
C  0.534091 -2.689309 0.224226
C  -0.652879 -4.408242 -0.971792
C  0.362306 -4.019354 -0.122541
C  2.54041 4.080727 -1.549509
C  2.744698 3.221299 -2.777778
C  2.389847 -1.363127 0.885232
C  2.980666 -0.785576 2.001209
C  2.723893 -0.93531 -0.393481
C  3.915744 0.225026 1.83361
C  3.652709 0.085402 -0.54297
C  4.252351 0.671311 0.562854
H  -2.819856 -1.218881 1.012597
H  -4.524055 -0.884749 0.961713
H  -4.325593 -0.395728 -1.535504
H  -4.084745 -2.056524 -1.062404
H  -3.48751 2.509139 2.967171
H  -4.595816 1.140603 2.979564
H  -2.882454 0.885252 3.274071
H  -5.600548 1.8411 0.048941
H  -4.557387 3.257535 0.098277
H  -4.431414 2.113623 -1.232844
H  -2.481418 -1.281618 -2.776071
H  -1.838679 -0.08124 -1.676244
H  -2.172747 2.819796 -1.42893
H  -0.629816 1.041338 2.155206
H  0.008557 3.68169 -1.963344
H  1.582354 1.908832 1.622899
H  -0.197344 -0.694222 -0.028887
H  -2.293216 -3.750632 -2.168028
H  -0.768807 -5.452868 -1.229919
H  3.467514 4.596264 -1.300308
H  1.785786 4.852368 -1.725789
H  3.029928 3.859548 -3.614747
H  3.545889 2.498265 -2.623574
H  1.844855 2.679489 -3.068818
H  2.713689 -1.129061 2.992537
H  2.278678 -1.38603 -1.270665
H  4.373636 0.671253 2.706581
H  3.909855 0.417928 -1.540204
H  4.976431 1.464467 0.435175
elementType: Si F O C H
totalener: -1510.05117351 hartree
nucrepener: 2992.52476970 hartree
electener: -4502.57594321 hartree
oneelecener: -8015.81824659 hartree
twoeener: 3513.24230338 hartree
cpcmener: -0.02795281 hartree
kineticenergy: 1503.91499322 hartree
xcener: -135.237930180751 hartree
chargesum: -0.0000000
charge: 0.514110 -0.220344 -0.344978 -0.339413 -0.281791 -0.150613 -0.207502 -0.457350 -0.453093 -0.082482 -0.136661 -0.065460 -0.026751 -0.235778 -0.336970 0.341336 -0.163424 -0.187099 0.211716 -0.192271 0.200551 0.042130 -0.271526 0.310378 -0.254951 -0.175587 -0.113502 -0.176601 -0.213658 0.083296 0.101362 0.086291 0.093476 0.104668 0.104443 0.102369 0.111942 0.113992 0.101750 0.100323 0.081744 0.147040 0.138548 0.141878 0.157853 0.124912 0.145664 0.149588 0.110660 0.092621 0.103188 0.084792 0.094676 0.144747 0.150474 0.157513 0.180384 0.157389
qa: 0.5141 -0.2203 -0.3450 -0.3394 -0.2818 -0.1506 -0.2075 -0.4574 -0.4531 -0.0825 -0.1367 -0.0655 -0.0268 -0.2358 -0.3370 0.3413 -0.1634 -0.1871 0.2117 -0.1923 0.2006 0.0421 -0.2715 0.3104 -0.2550 -0.1756 -0.1135 -0.1766 -0.2137 0.0833 0.1014 0.0863 0.0935 0.1047 0.1044 0.1024 0.1119 0.1140 0.1017 0.1003 0.0817 0.1470 0.1385 0.1419 0.1579 0.1249 0.1457 0.1496 0.1107 0.0926 0.1032 0.0848 0.0947 0.1447 0.1505 0.1575 0.1804 0.1574
va: 4.1336 1.0653 2.0528 2.0734 3.8354 3.9011 3.7100 3.9038 3.9111 3.8156 3.8264 3.7810 3.7072 3.9164 3.9969 3.7473 3.7989 3.8837 3.6490 3.8966 4.0419 3.8416 3.9098 3.6367 3.9662 3.8519 3.8403 3.8290 3.8646 1.0139 1.0074 1.0017 0.9994 1.0084 1.0094 1.0097 1.0063 1.0077 1.0046 1.0085 1.0152 0.9873 0.9942 1.0023 1.0026 1.0160 0.9992 0.9981 0.9924 0.9976 1.0111 1.0064 1.0018 1.0093 1.0027 0.9886 0.9729 0.9935
dispcorr: -0.034974794 hartree
energy: -1510.086148301219
dipole: -18.13016 17.36307 -0.76709 26.85633 -25.46385 1.39248 -8.73412 7.08799 -1.64613
magnitude: 2.28849 au
magnitude: 5.81688 debye
