program: Orca
programVersion: 5.0.2
elementType: Si F O O C C C C C C C C C C C C C C C C C C C C C C C C C H H H H H H H H H H H H H H H H H H H H H H H H H H H H H
charge: 0
multiplicity: 1
keywords: wb97x-d3
keywords: def2-TZVPP
keywords: def2/J RIJCOSX
keywords: DEFGRID2
keywords: scfconv7
keywords: smallprint printgap noloewdin
keywords: NOSOSCF
formula: C25H29FO2Si
InChI: InChI=1/C25H29FO2Si/c1-4-27-21-13-15-23(16-14-21)29(2,3)18-8-9-20-12-17-24(26)25(19-20)28-22-10-6-5-7-11-22/h5-7,10-17,19H,4,8-9,18H2,1-3H3
58 atoms
Si -3.520436 1.803496 0.530768
F  1.850557 -4.852394 0.27298
O  1.778644 2.407073 -2.327459
O  2.302016 -2.230431 0.336631
C  -4.178212 0.054516 0.218922
C  -3.131836 -1.053165 0.393797
C  -1.856354 2.050475 -0.312328
C  -3.283981 2.01453 2.385803
C  -4.755629 3.057334 -0.134502
C  -2.386135 -1.367542 -0.906526
C  -1.768308 2.296742 -1.68866
C  -0.653433 1.932392 0.381172
C  -1.244578 -2.312106 -0.670048
C  -0.552612 2.411106 -2.334912
C  0.584665 2.041654 -0.246033
C  0.638629 2.281824 -1.616225
C  0.00534 -1.808667 -0.319715
C  -1.422152 -3.691181 -0.722701
C  1.047485 -2.660174 0.011707
C  -0.378818 -4.554345 -0.419362
C  0.838259 -4.031098 -0.0411
C  3.025211 2.250207 -1.658683
C  4.127349 2.441069 -2.669997
C  2.474321 -1.137245 1.149199
C  1.588916 -0.8004 2.165461
C  3.628662 -0.395363 0.941236
C  1.862833 0.303326 2.961378
C  3.894255 0.698517 1.752085
C  3.010023 1.059008 2.759735
H  -5.001414 -0.092114 0.926227
H  -4.634676 -0.013488 -0.773974
H  -3.604322 -1.97349 0.749309
H  -2.403277 -0.780779 1.165829
H  -2.857564 2.987863 2.635562
H  -4.240402 1.932865 2.906808
H  -2.624852 1.251127 2.80475
H  -4.893826 2.952961 -1.212544
H  -5.735422 2.926033 0.3297
H  -4.435801 4.08296 0.058111
H  -3.090028 -1.798251 -1.623067
H  -2.011797 -0.44276 -1.350147
H  -2.670778 2.399389 -2.281323
H  -0.656217 1.742432 1.448817
H  -0.513108 2.599705 -3.400878
H  1.48372 1.938129 0.348283
H  0.159042 -0.735506 -0.295771
H  -2.383326 -4.101256 -1.005721
H  -0.510788 -5.627582 -0.465565
H  3.085859 1.254438 -1.209572
H  3.116941 2.983568 -0.850882
H  4.068114 1.705027 -3.471975
H  4.102248 3.438368 -3.109577
H  5.091426 2.318768 -2.176979
H  0.693883 -1.381823 2.344309
H  4.314684 -0.674459 0.151614
H  1.170178 0.566293 3.750138
H  4.79523 1.274497 1.586766
H  3.215395 1.916135 3.386635
elementType: Si F O C H
totalener: -1510.05319690 hartree
nucrepener: 2975.77031161 hartree
electener: -4485.82350851 hartree
oneelecener: -7981.33999888 hartree
twoeener: 3495.51649036 hartree
cpcmener: -0.02532965 hartree
kineticenergy: 1503.91694842 hartree
xcener: -135.235513003056 hartree
chargesum: -0.0000000
charge: 0.489893 -0.220260 -0.340114 -0.341418 -0.281419 -0.132138 -0.155271 -0.433234 -0.456671 -0.063645 -0.111401 -0.171905 -0.016869 -0.274908 -0.212061 0.340734 -0.168025 -0.192084 0.204256 -0.179267 0.186058 0.075944 -0.281821 0.339357 -0.203816 -0.287862 -0.177802 -0.129463 -0.152525 0.094408 0.083049 0.095750 0.074534 0.109529 0.109681 0.099360 0.101493 0.103801 0.104696 0.093070 0.084569 0.135986 0.154108 0.134099 0.110508 0.116171 0.144688 0.149863 0.094521 0.095374 0.088993 0.090347 0.091038 0.155612 0.151702 0.161561 0.160064 0.159159
qa: 0.4899 -0.2203 -0.3401 -0.3414 -0.2814 -0.1321 -0.1553 -0.4332 -0.4567 -0.0636 -0.1114 -0.1719 -0.0169 -0.2749 -0.2121 0.3407 -0.1680 -0.1921 0.2043 -0.1793 0.1861 0.0759 -0.2818 0.3394 -0.2038 -0.2879 -0.1778 -0.1295 -0.1525 0.0944 0.0830 0.0958 0.0745 0.1095 0.1097 0.0994 0.1015 0.1038 0.1047 0.0931 0.0846 0.1360 0.1541 0.1341 0.1105 0.1162 0.1447 0.1499 0.0945 0.0954 0.0890 0.0903 0.0910 0.1556 0.1517 0.1616 0.1601 0.1592
va: 4.1307 1.0641 2.0792 2.0724 3.8385 3.8723 3.7429 3.8992 3.9083 3.7633 3.8529 3.8258 3.6983 4.0331 3.7944 3.7571 3.8829 3.8896 3.6700 3.8845 4.0390 3.7817 3.9793 3.6099 3.8499 3.9409 3.8586 3.8355 3.8411 1.0091 1.0109 1.0068 1.0033 1.0068 1.0099 1.0102 1.0117 1.0095 1.0089 1.0124 1.0179 0.9924 0.9801 1.0142 1.0356 1.0108 1.0010 0.9980 0.9836 0.9861 1.0032 1.0037 1.0053 0.9981 1.0076 0.9906 0.9885 0.9891
dispcorr: -0.034596058 hartree
energy: -1510.087792960271
dipole: -17.23669 16.58546 -0.65124 25.83014 -25.02828 0.80187 0.57021 -0.02021 0.55000
magnitude: 1.17030 au
magnitude: 2.97466 debye
